program: Gaussian 09
title: Title Card Required
version: EM64L-G09RevD.01
method: RM06
basis: GenECP
operation: Freq
keyword: #N
keyword: Geom=AllCheck
keyword: Guess=TCheck
keyword: SCRF=Check
keyword: GenChk
keyword: RM06/GenECP
keyword: Freq
converged: YES YES NO YES
title: Mulliken charges:
elementType: C C C C C C H O H O H H Pd P C C C C H C H C H H H C C C C H C H C H H H C C C C H C H C H H H C C C C C C H H H H C H H H B O H O H P C C C C H C H C H H H C C C C H C H C H H H C C C C H C H C H H H C C C C C C H H H H C H H H B O H O H
charge: -0.154407 -0.204733 0.452603 -0.211106 -0.227727 0.348881 0.137754 -0.698605 0.138427 -0.631490 0.127621 0.139037 -0.286969 0.574718 -0.123209 -0.176383 -0.173061 -0.151356 0.174573 -0.154700 0.222831 -0.156060 0.166645 0.164576 0.165366 -0.088630 -0.150575 -0.183042 -0.147338 0.180345 -0.137286 0.161558 -0.151980 0.172654 0.164388 0.164721 -0.076195 -0.161832 -0.140319 -0.149493 0.157510 -0.131219 0.170556 -0.151591 0.156581 0.161230 0.159643 -0.201767 -0.195644 0.060295 -0.206235 -0.187142 0.170021 0.134995 0.131961 0.150307 0.133264 -0.596906 0.167744 0.168873 0.196775 0.420774 -0.506609 0.422167 -0.690455 0.468922 0.588129 -0.063965 -0.151207 -0.160233 -0.139168 0.157280 -0.146470 0.147368 -0.151432 0.165406 0.153835 0.157290 -0.081313 -0.166245 -0.168225 -0.154286 0.164152 -0.147035 0.182419 -0.161276 0.167040 0.165659 0.166481 -0.114397 -0.168568 -0.164246 -0.155553 0.170958 -0.154824 0.226377 -0.157246 0.161246 0.172474 0.164250 -0.392030 -0.095940 0.173706 -0.165644 -0.207146 0.113647 0.206385 0.147841 0.146801 0.172373 -0.582590 0.183312 0.169188 0.168737 0.660098 -0.720612 0.393035 -0.764320 0.404236
chargesum: 0.00000
title: Mulliken charges with hydrogens summed into heavy atoms:
elementType: C C C C C C O O Pd P C C C C C C C C C C C C C C C C C C C C C C C C C B O O P C C C C C C C C C C C C C C C C C C C C C C C C C B O O
charge: -0.015980 -0.066979 0.452603 -0.072069 -0.100106 0.348881 -0.276437 -0.631490 -0.286969 0.574718 -0.123209 -0.001810 0.049770 0.015288 0.009876 0.009306 -0.088630 0.029770 -0.021484 0.025315 0.027102 0.012741 -0.076195 -0.004322 0.030237 0.007088 0.030011 0.008052 -0.066772 -0.063683 0.060295 -0.055928 -0.053878 0.170021 -0.063515 0.420774 -0.506609 -0.221534 0.588129 -0.063965 0.006073 -0.012865 0.026239 0.007365 0.005857 -0.081313 -0.002092 0.014195 0.012754 0.018624 0.005205 -0.114397 0.002390 0.062130 0.005692 0.017651 0.007004 -0.185644 0.051901 0.173706 -0.018843 -0.034772 0.113647 -0.061352 0.660098 -0.327578 -0.360085
1716.lowfreq: -8.9535 0.0004 0.0009 0.0011 6.1403 8.1250 20.4297 25.5804 27.8931
redmass: 5.7158 5.6374 5.9121 5.9045 5.7931 5.7174 6.0737 5.4516 6.2872 4.9990 4.9202 4.8027 5.5628 5.3405 5.1680 5.3288 5.5688 5.1534 5.0078 5.2137 4.9082 5.6409 4.9379 6.1392 4.3942 5.1196 4.6098 5.3589 6.7182 5.4649 6.8035 4.5778 5.6798 6.6232 4.7283 6.1675 6.4790 1.0459 1.8958 3.5117 6.6195 4.4181 4.8450 5.9668 5.0764 4.9458 5.7189 5.0030 4.9390 4.9161 5.0662 5.4519 6.7467 4.8414 4.2671 5.4731 4.9647 5.0397 5.3545 4.7807 4.4524 1.3746 1.0917 1.7830 2.6750 2.6051 2.7714 6.7616 2.7805 2.8301 4.7802 3.3981 3.2879 4.3395 3.1069 3.0975 3.8146 4.4241 3.4698 3.2475 5.6755 3.5031 6.3128 2.8285 5.5916 5.5536 4.7166 3.0788 3.9607 5.0970 6.2946 6.9501 4.9940 5.3160 4.7613 4.7887 4.8103 2.5109 3.1933 6.5565 4.7060 6.3162 6.3296 5.9247 6.3700 6.3263 6.3679 2.5216 6.9225 6.8603 7.0920 4.4608 2.6141 4.2022 3.1833 5.6892 2.2989 2.6567 2.4671 2.6337 3.2266 2.9850 5.6281 3.9102 4.9011 6.5545 2.3344 1.9073 3.4814 1.7107 1.4882 2.7282 1.5324 1.7047 1.6044 5.5903 4.0895 1.3554 4.0109 1.3081 1.4572 1.5294 1.2828 2.7055 1.3304 1.2588 1.2512 1.2661 1.2471 1.2517 5.9409 1.3071 1.3380 1.3185 1.4210 1.4466 2.1582 1.3262 1.3328 1.3188 1.2507 1.3497 1.3601 1.3270 1.3167 1.3263 1.3207 1.2861 1.3083 1.3161 1.5303 1.2919 2.9298 2.0989 3.9036 1.5852 2.2170 4.1645 2.2184 1.9647 2.6772 2.0918 2.4769 2.4107 2.0632 1.5511 1.4341 1.3326 2.4810 2.7523 2.8704 2.7691 1.5715 2.5500 2.8307 2.9764 1.5164 1.6762 1.2312 1.6139 1.6526 1.6228 1.6406 1.6841 1.6340 1.6304 1.3774 2.1324 2.6341 2.4899 2.3355 2.4612 2.6888 2.4399 1.0977 1.0752 1.0730 1.0895 1.0757 2.5290 1.0845 1.0821 1.1339 1.1797 1.3109 1.5057 1.1257 1.3120 1.1881 1.1558 1.1475 1.2603 1.9082 2.2255 2.7431 2.4837 1.6550 1.3328 1.3255 1.6783 1.6173 1.6085 1.7549 2.0065 1.5301 5.1365 5.9806 3.4669 3.6087 3.4087 3.3248 4.1354 4.2479 2.6708 3.9305 3.6693 1.3312 1.4173 2.6719 3.0078 3.7066 2.3342 2.3239 2.3859 2.2893 2.3860 3.4673 2.2952 1.0597 1.1433 1.0561 1.1085 2.1624 2.1563 2.1448 2.1233 2.3049 2.3396 2.2116 3.3403 3.0105 5.2599 6.4720 5.7228 5.7161 5.8268 5.8209 5.9370 6.4872 5.9228 5.9297 5.8789 5.9718 5.9861 6.0118 5.9088 6.0741 6.5755 6.9173 1.0392 1.0400 1.0981 1.0987 1.1029 1.0894 1.1004 1.0888 1.0892 1.0895 1.0873 1.0863 1.0887 1.0931 1.0868 1.0936 1.0865 1.0852 1.0855 1.0846 1.0865 1.0880 1.0925 1.0876 1.0882 1.0897 1.0903 1.0891 1.0936 1.0918 1.0924 1.0925 1.0937 1.0929 1.0914 1.0965 1.0936 1.0964 1.0953 1.0962 1.0974 1.0967 1.0953 1.0925 1.0931 1.0901 1.0927 1.0827 1.0655 1.0660 1.0653 1.0658
temp: 298.150 k
press: 1.00000 atm
elementType: 6 6 6 6 6 6 1 8 1 8 1 1 46 15 6 6 6 6 1 6 1 6 1 1 1 6 6 6 6 1 6 1 6 1 1 1 6 6 6 6 1 6 1 6 1 1 1 6 6 6 6 6 6 1 1 1 1 6 1 1 1 5 8 1 8 1 15 6 6 6 6 1 6 1 6 1 1 1 6 6 6 6 1 6 1 6 1 1 1 6 6 6 6 1 6 1 6 1 1 1 6 6 6 6 6 6 1 1 1 1 6 1 1 1 5 8 1 8 1
symmnumber: 1
zpe: 2486117.8 jmol-1
zpe.correction: 0.946912 hartree
zpe.thermalcorrener: 1.009140 hartree
zpe.thermalcorrenthalpy: 1.010085 hartree
zpe.thermalcorrgfe: 0.851163 hartree
zpe.sumelectzpe: -3473.083080 hartree
zpe.sumelectthermal: -3473.020852 hartree
zpe.sumelectthermalent: -3473.019908 hartree
zpe.sumelectthermalfe: -3473.178829 hartree
dipole: -5.4087 0.7452 5.8793
dipole: 8.0235
quadrupole: -379.7266 -369.4955 -395.1550
quadrupole: -0.7365 2.6743 2.2642
quadrupole: 1.7325 11.9635 -13.6960 -0.7365 2.6743 2.2642
hfenergy: -3474.0299923 hartree
pointgroup: C01 [X(C56H52B2O6P2Pd1)]
dipole: -2.1587135 -0.2114983 2.2934317 debye
polarizability: 794.4953059|1.4691835|717.2225449|25.2837076|16.918999|662.1096555 unknown
InChI: InChI=1S/2C18H15P.C14H17B2O4.C6H5O2.Pd/c2*1-4-10-16(11-5-1)19(17-12-6-2-7-13-17)18-14-8-3-9-15-18;1-11-3-7-13(8-4-11)15(17)20-16(18,19)14-9-5-12(2)6-10-14;7-5-1-2-6(8)4-3-5;/h2*1-15H;3-10,17-19H,1-2H3;1-4,7H;/q;;;-1;+1
charge 0 multiplicity 1
119 atoms
C  3.62844734 -0.48558741 1.36297867
C  2.27544384 -0.37052298 1.07651722
C  1.33740696 -0.11476898 2.08789056
C  1.81711197 0.05941175 3.39720312
C  3.16888203 -0.07292781 3.68666403
C  4.08224129 -0.35039904 2.67041028
H  1.92916995 -0.46041964 0.04168286
O  5.42678345 -0.48309225 2.89726649
H  4.34812314 -0.67573952 0.56865903
O  0.02033296 -0.06813177 1.89395905
H  3.51710199 0.04981969 4.71505581
H  1.09583328 0.28138711 4.18352502
Pd -0.83425836 0.11314853 0.02368014
P  -0.77467414 2.46905267 0.59085187
C  -2.05027259 2.76149616 1.87398489
C  -2.78475242 3.94944181 1.94348446
C  -2.23625647 1.78172677 2.85881723
C  -3.71145084 4.14246125 2.96378822
H  -2.63093679 4.7312783 1.20144915
C  -3.16235579 1.98313756 3.87634689
H  -1.61409499 0.88574687 2.83973303
C  -3.90753159 3.15809084 3.92648643
H  -4.27894791 5.0706865 3.00589914
H  -3.2964895 1.21840726 4.64018943
H  -4.63361247 3.31211272 4.72325648
C  -1.1085818 3.71127864 -0.71227499
C  -0.06361554 4.43641069 -1.29010292
C  -2.40142447 3.84989508 -1.23937008
C  -0.30552565 5.27883948 -2.37061932
H  0.95200486 4.3296351 -0.91697819
C  -2.63844228 4.69109211 -2.31756019
H  -3.23335271 3.28988579 -0.81048001
C  -1.58808505 5.40487961 -2.8887486
H  0.52320428 5.82822436 -2.81337224
H  -3.64689264 4.78377435 -2.71689311
H  -1.77195009 6.05805575 -3.74012949
C  0.78754271 2.98723048 1.36580385
C  0.80441129 3.62368292 2.61023567
C  1.99350282 2.71356174 0.71073068
C  2.01611094 3.99199015 3.18413959
H  -0.12708237 3.82950863 3.13607374
C  3.20118519 3.08342215 1.29115743
H  1.99431027 2.22361674 -0.26392575
C  3.21324352 3.71861499 2.52847714
H  2.02324543 4.48804485 4.15345267
H  4.1326407 2.83608381 0.78303558
H  4.16080537 3.99568008 2.98822953
C  4.86621528 -1.30696566 -1.86775122
C  3.60214287 -0.84834468 -2.22246526
C  3.29446283 0.51757996 -2.22999974
C  4.32169479 1.40684764 -1.8896818
C  5.58369818 0.95443483 -1.52189832
C  5.87227925 -0.41212084 -1.49267737
H  5.07923926 -2.37779905 -1.86256658
H  2.82644283 -1.56366559 -2.50394713
H  4.11580245 2.47828179 -1.9209416
H  6.36318898 1.66720479 -1.24482741
C  7.19817402 -0.90638339 -0.9972816
H  7.46963799 -1.86938852 -1.44856652
H  8.0037776 -0.19145848 -1.20870307
H  7.17171277 -1.05192756 0.09386943
B  1.86903928 1.04395192 -2.6462119
O  0.89423243 0.15606849 -2.94125105
H  5.59466165 -0.33303435 3.83696149
O  1.69769255 2.40414794 -2.68264315
H  0.8203312 2.55409669 -3.10375718
P  -0.8644725 -2.33949968 0.1323354
C  0.11079985 -2.99955554 1.54374712
C  1.45824567 -3.3056624 1.32113151
C  -0.41449228 -3.15712969 2.82787672
C  2.26118416 -3.76259424 2.35864481
H  1.89370442 -3.18026763 0.32897249
C  0.39206979 -3.61059992 3.86614351
H  -1.46057172 -2.93189114 3.02774609
C  1.73031761 -3.9119726 3.63526301
H  3.31032978 -3.98192128 2.16862432
H  -0.03223188 -3.73012199 4.86190648
H  2.3600845 -4.26225958 4.45156276
C  -2.57549314 -2.83833215 0.56476414
C  -3.22253147 -3.95307945 0.02828349
C  -3.23320664 -2.07874718 1.54105405
C  -4.47798015 -4.3316984 0.49812534
H  -2.74888308 -4.53241195 -0.76269705
C  -4.47985194 -2.46517804 2.01825771
H  -2.75563922 -1.17736152 1.93186051
C  -5.10050826 -3.60175074 1.50487177
H  -4.96764144 -5.20771709 0.07549207
H  -4.97172541 -1.87199676 2.78786473
H  -6.07636074 -3.90725199 1.87898352
C  -0.28690334 -3.42916335 -1.21569208
C  -0.2969608 -4.82540631 -1.07383585
C  0.2717676 -2.86288833 -2.36007008
C  0.18663662 -5.6332341 -2.09476663
H  -0.66417382 -5.2819707 -0.15412786
C  0.75908948 -3.67716462 -3.38051737
H  0.35462833 -1.78165651 -2.46252726
C  0.70563425 -5.05929603 -3.25543007
H  0.16804056 -6.71603688 -1.9808122
H  1.17397182 -3.20781508 -4.27139933
H  1.08195265 -5.69689183 -4.0540843
C  -2.20489319 0.60955132 -1.7643765
C  -3.45376953 0.31789612 -1.15351077
C  -4.19260017 -0.78083549 -1.54704822
C  -3.63770988 -1.61247678 -2.54089214
C  -2.40605456 -1.35421279 -3.12182927
C  -1.66467426 -0.20852345 -2.78676916
H  -1.85870341 1.64019745 -1.77682703
H  -3.86396325 0.999606 -0.40156269
H  -4.21871574 -2.4778381 -2.87053207
H  -2.03368631 -2.00256115 -3.91411848
C  -5.56871179 -1.0472236 -1.01816532
H  -6.32983901 -0.84373741 -1.78536629
H  -5.69129553 -2.09487767 -0.71381195
H  -5.79667604 -0.41540889 -0.15041478
B  -0.38690247 0.35605418 -3.66189821
O  -0.38032189 -0.36570248 -4.91344146
H  0.48410124 -0.23688742 -5.32062343
O  -0.59338337 1.81943165 -3.83570771
H  -1.02993244 1.95153041 -4.68408644
