program: Gaussian 09
title: Title Card Required
version: EM64L-G09RevD.01
method: RM06
basis: GenECP
operation: Freq
keyword: #N
keyword: Geom=AllCheck
keyword: Guess=TCheck
keyword: SCRF=Check
keyword: GenChk
keyword: RM06/GenECP
keyword: Freq
converged: YES YES NO YES
title: Mulliken charges:
elementType: C C C C C C H O H O H H C C C C C C H H H H B O H O H Pd P C C C C H C H C H H H C C C C H C H C H H H C C C C H C H C H H H C H H H C C C C C C H H H H C H H H B O H O H
charge: -0.197119 -0.191174 0.426440 -0.209408 -0.224455 0.370336 0.157439 -0.695847 0.145495 -0.625471 0.131144 0.140322 -0.176810 -0.195827 -0.065502 -0.203642 -0.181456 0.168631 0.141403 0.194878 0.134927 0.137945 0.731011 -0.675341 0.449760 -0.639427 0.492374 -0.079391 0.472311 -0.117579 -0.169831 -0.179119 -0.153203 0.162615 -0.155466 0.226296 -0.155861 0.160871 0.167366 0.161679 -0.088222 -0.174632 -0.200480 -0.142898 0.166906 -0.144378 0.171417 -0.151917 0.164984 0.158332 0.163995 -0.079372 -0.167129 -0.132156 -0.151493 0.156982 -0.126757 0.164736 -0.167713 0.157034 0.150156 0.156262 -0.596874 0.183836 0.169887 0.177810 -0.185489 -0.178909 0.049123 -0.197390 -0.190584 0.164891 0.147732 0.167047 0.160360 0.146217 -0.596872 0.171862 0.185060 0.192829 0.500139 -0.506017 0.425164 -0.617479 0.462686
chargesum: 0.00000
title: Mulliken charges with hydrogens summed into heavy atoms:
elementType: C C C C C C O O C C C C C C B O O Pd P C C C C C C C C C C C C C C C C C C C C C C C C C C B O O
charge: -0.051624 -0.033735 0.426440 -0.069085 -0.093311 0.370336 -0.270683 -0.625471 -0.035406 -0.000948 -0.065502 -0.068715 -0.043511 0.168631 0.731011 -0.225581 -0.147053 -0.079391 0.472311 -0.117579 -0.007216 0.047177 0.007668 0.011900 0.005818 -0.088222 -0.007726 -0.029064 0.022085 0.013954 0.012079 -0.079372 -0.010148 0.032580 0.005541 0.023399 -0.011450 -0.065342 -0.037757 -0.011862 0.049123 -0.037030 -0.044368 0.164891 -0.047121 0.500139 -0.506017 -0.154793
1716.lowfreq: -8.5940 -8.2841 0.0008 0.0011 0.0013 7.5060 20.9821 26.7663 32.3860
frequency: 20.7559 26.4057 32.2706 37.7302 41.8843 46.0996 48.3621 52.9562 53.7322 59.6019 60.6725 69.7512 73.6314 75.1594 77.9051 86.9923 90.6732 96.2481 102.0101 103.2506 105.8199 116.0260 128.1042 135.8008 142.8381 146.2235 156.6728 158.0742 164.2348 182.4178 194.5089 200.5021 206.2551 210.6013 224.6587 228.2465 236.3128 251.2789 254.9141 257.1304 263.4228 276.6492 287.3348 295.3800 321.1383 326.9885 345.6366 358.7036 372.9835 385.6251 403.0110 412.9407 414.3805 422.2853 425.9268 429.8215 431.1414 431.5216 435.9519 436.4514 448.3620 477.9082 482.2425 494.5749 498.5860 504.0934 510.9562 513.6019 515.4351 523.4620 563.9802 571.9767 581.8829 619.9044 621.8248 627.6803 633.3249 640.1320 643.0962 655.2221 657.3454 684.4607 692.6341 694.8559 703.3477 711.5781 714.9639 716.6520 718.8892 721.3076 724.6075 745.9902 747.1623 755.3845 762.1000 788.2723 794.4015 804.0822 809.1187 816.7668 834.4538 835.6747 840.8877 845.9759 854.9270 866.7448 872.1697 873.5276 877.3963 883.5554 902.0890 919.9581 944.6391 945.1509 955.6321 961.2766 964.3786 974.7657 980.4371 983.4754 991.1238 994.6274 1000.7355 1002.7187 1003.3342 1003.6941 1005.3697 1011.9071 1015.0419 1015.1862 1023.4598 1031.5849 1034.1133 1051.4582 1053.3594 1054.8092 1055.5413 1058.0879 1058.9444 1061.0493 1071.4524 1100.1131 1102.3216 1104.3279 1104.6889 1110.9382 1123.6816 1125.3369 1128.4398 1128.8571 1141.1633 1161.7749 1168.7015 1169.5285 1170.2313 1173.8901 1196.3171 1197.4652 1198.4079 1198.9820 1201.5407 1210.6406 1244.7741 1253.9142 1285.8188 1296.0618 1313.6560 1318.6683 1320.8922 1321.3736 1327.6722 1334.6437 1340.4752 1342.4614 1353.5538 1360.5278 1363.0687 1363.3607 1368.7450 1385.5864 1415.4516 1418.8787 1419.2258 1429.3570 1451.8496 1467.1964 1471.0679 1473.2895 1478.1427 1482.9507 1484.2353 1489.1052 1500.3424 1501.8542 1515.1580 1516.4484 1516.6200 1519.0170 1542.7833 1561.7288 1615.7856 1623.2100 1637.3511 1638.7544 1640.3997 1640.5576 1651.1193 1655.4023 1656.0855 1658.1651 1678.0966 1679.2809 3030.5149 3031.0450 3101.7534 3102.2468 3125.3898 3126.7372 3140.9692 3146.0813 3147.7340 3149.3790 3149.9000 3158.2323 3161.7035 3164.0632 3166.4507 3167.5032 3167.6598 3173.9262 3174.1023 3176.8900 3180.1021 3180.3579 3180.8426 3182.8709 3183.1390 3186.9216 3188.5818 3190.5639 3190.6178 3193.6085 3195.0162 3196.9186 3199.7516 3658.8553 3755.3511 3821.7258 3858.2268
redmass: 5.4314 5.6107 5.0587 5.5219 5.5782 5.7868 5.4948 5.4426 5.1468 1.0441 4.5548 4.3026 4.9548 4.4610 5.3571 5.3314 5.1820 5.4996 6.6879 5.6178 5.1158 5.0131 6.5974 6.1471 5.5798 5.6378 5.0193 5.4707 5.2659 6.2639 4.4622 1.3886 5.6387 4.1187 5.4241 7.4238 5.7254 7.4701 5.8415 4.8423 6.0207 4.9284 4.5962 5.0729 1.5759 2.4216 3.1389 2.8682 6.5138 4.9303 2.9088 3.1050 3.0865 3.5023 4.8241 4.7866 3.5867 3.5272 6.8649 5.2342 6.5574 3.9075 5.8205 3.3973 4.4536 1.7448 3.2450 3.1950 2.3044 4.9896 3.6476 5.3170 4.8571 6.3486 6.3667 6.4044 2.4244 2.2762 2.8668 6.9555 6.4826 5.7414 1.9642 6.2047 4.0407 4.7502 3.1164 5.2845 3.8768 3.0478 4.2367 4.1300 1.7663 1.4714 1.5058 5.5924 1.3678 4.1180 2.2491 1.7070 1.5662 1.6098 1.3215 1.1687 1.2527 5.0423 1.2623 1.3065 4.7887 1.2439 1.3382 1.3310 1.3238 1.3351 1.3622 1.2699 1.2526 1.2862 1.2795 1.2522 1.2993 1.2825 1.5020 5.6016 5.3738 5.5514 1.4617 1.2742 3.2985 2.5410 2.6523 1.7212 1.3592 1.4956 1.9358 2.1754 2.6268 1.5304 1.7481 1.4611 2.5059 1.6459 1.4954 1.5189 1.2777 1.9781 2.7903 2.7095 1.5153 2.0948 1.3229 1.0999 1.5807 1.1092 1.0900 1.0886 1.1775 1.1679 1.2025 1.1285 1.1432 1.1272 2.6257 2.6213 2.5561 1.7165 1.7153 1.6158 1.9619 1.6411 1.7486 1.7383 5.8270 4.4354 4.3827 3.2893 4.3959 3.8318 2.8828 5.1866 2.1480 1.3000 1.4767 2.9817 5.0367 2.2871 2.3088 2.2936 3.4607 1.0710 1.0459 1.0930 2.2013 1.6926 2.1617 2.5142 2.2170 2.1290 3.2499 2.9247 6.0669 5.8861 5.7912 5.9219 5.9552 6.3876 6.2120 5.9814 5.7993 6.0327 6.4671 6.5797 1.0378 1.0386 1.1007 1.0998 1.1025 1.1023 1.0887 1.0890 1.0930 1.0896 1.0849 1.0878 1.0884 1.0840 1.0904 1.0858 1.0896 1.0871 1.0854 1.0894 1.0931 1.0926 1.0943 1.0939 1.0898 1.0940 1.0916 1.0943 1.0949 1.0906 1.0962 1.0982 1.0987 1.0657 1.0654 1.0659 1.0656
irintensity: 0.0614 0.1881 0.1167 0.0534 0.2062 0.1314 0.0913 0.1943 0.4850 0.2925 0.3602 0.1126 0.2694 0.0695 1.3935 0.9162 1.1799 0.7377 0.7096 0.4518 0.0742 0.7224 1.3922 1.7945 0.0594 1.6384 1.7248 1.2387 1.6296 1.8062 0.6637 0.7855 2.9814 1.2683 5.4659 9.8978 1.4921 11.1100 5.3148 0.4763 0.3050 0.4416 0.8336 1.5795 56.1764 70.5715 0.1334 0.6066 18.1405 1.5166 0.2795 0.2666 0.7976 1.2084 2.2181 1.1190 3.6970 1.3508 6.6005 1.6583 10.5766 17.5411 7.2973 21.5857 14.2332 60.6914 67.3509 9.8986 53.5944 43.5024 9.4235 1.8414 1.3853 0.3339 2.1069 0.4142 12.3578 14.9385 11.7162 1.4599 20.3330 75.1349 17.7962 3.6656 1.3223 2.0866 22.4713 8.5707 1.8536 13.3543 32.9257 23.5299 9.2394 16.4405 17.7075 44.8214 8.9572 10.6422 18.6667 22.3174 20.9286 30.7935 13.7504 171.2528 2.0446 6.9438 0.8995 0.2407 0.6341 1.6122 0.6874 1.9045 0.4343 0.1737 0.8852 2.8049 2.1325 1.4502 0.8432 0.1262 0.1118 0.2789 2.4694 0.7844 2.7621 1.1589 0.8850 3.0804 24.2835 15.6291 21.1628 41.0034 10.0182 1.4842 1.2673 6.5592 1.1166 17.0218 36.0903 155.9501 2.0907 0.6607 0.5590 1.6022 14.7876 32.7075 19.6894 11.7704 11.3602 30.4355 5.5521 5.8191 110.1166 9.0558 0.2722 4.7424 63.7893 71.3422 52.4690 3.3503 8.7412 3.7161 9.6703 0.8818 167.6371 27.0890 64.5682 7.4652 116.2908 48.6866 1.8253 225.5400 6.0556 5.9684 61.3322 1.1707 1.4137 6.9901 65.8283 213.6504 1.0186 0.8510 0.7493 130.9653 367.0705 15.5616 9.5513 27.5434 35.4994 11.2906 6.8490 10.0756 170.2956 221.1215 5.4271 87.3130 9.8101 12.9374 225.1055 15.4943 1.4886 6.4976 0.9708 1.8070 0.9236 11.9612 9.6880 0.9821 0.0906 0.9059 7.4808 89.4564 24.5711 63.5539 18.7667 15.9955 13.6495 12.5390 9.4507 34.7690 38.4561 29.6940 9.9796 11.5040 15.3389 5.1257 40.3782 1.3837 14.9092 9.7446 0.8520 4.9913 16.1898 7.0635 33.8844 1.5581 8.7030 18.2054 23.0439 26.3370 6.3773 1.7116 17.3175 44.2949 30.3797 315.2113 276.0115 92.4826 135.4439
temp: 298.150 k
press: 1.00000 atm
elementType: 6 6 6 6 6 6 1 8 1 8 1 1 6 6 6 6 6 6 1 1 1 1 5 8 1 8 1 46 15 6 6 6 6 1 6 1 6 1 1 1 6 6 6 6 1 6 1 6 1 1 1 6 6 6 6 1 6 1 6 1 1 1 6 1 1 1 6 6 6 6 6 6 1 1 1 1 6 1 1 1 5 8 1 8 1
symmnumber: 1
zpe: 1763822.7 jmol-1
zpe.correction: 0.671805 hartree
zpe.thermalcorrener: 0.717696 hartree
zpe.thermalcorrenthalpy: 0.718640 hartree
zpe.thermalcorrgfe: 0.591978 hartree
zpe.sumelectzpe: -2437.659895 hartree
zpe.sumelectthermal: -2437.614004 hartree
zpe.sumelectthermalent: -2437.613059 hartree
zpe.sumelectthermalfe: -2437.739721 hartree
dipole: 3.2274 -4.0953 0.9696
dipole: 5.3036
quadrupole: -269.4103 -275.8981 -287.0182
quadrupole: 9.0192 -5.0057 2.1923
quadrupole: 8.0319 1.5441 -9.5760 9.0192 -5.0057 2.1923
hfenergy: -2438.3316994 hartree
pointgroup: C01 [X(C38H37B2O6P1Pd1)]
dipole: 1.8932361 -0.3366208 -0.8100885 debye
polarizability: 539.5586154|42.789193|497.7584929|7.8986834|42.5369425|493.8305179 unknown
InChI: InChI=1S/C18H15P.C7H10B2O4.C7H7.C6H5O2.Pd/c1-4-10-16(11-5-1)19(17-12-6-2-7-13-17)18-14-8-3-9-15-18;1-6-2-4-7(5-3-6)8(10)13-9(11)12;1-7-5-3-2-4-6-7;7-5-1-2-6(8)4-3-5;/h1-15H;2-5,10-12H,1H3;3-6H,1H3;1-4,7H;/q;;;-1;+1
charge 0 multiplicity 1
85 atoms
C  -1.60461492 2.52229773 3.0073034
C  -1.90037301 1.74827031 1.89580955
C  -1.57703315 2.18143804 0.59540735
C  -0.98815382 3.44993786 0.45968668
C  -0.72001028 4.2405132 1.56972006
C  -0.9987101 3.76887462 2.84981945
H  -2.36932314 0.76969539 2.0090551
O  -0.68262284 4.46973732 3.9791901
H  -1.83470795 2.17754953 4.01569274
O  -1.83714636 1.45357802 -0.49277815
H  -0.24509133 5.21611582 1.4422373
H  -0.7341547 3.80105007 -0.54053662
C  -5.2801983 -0.88120005 -0.77225466
C  -3.98380567 -0.37797622 -0.80657937
C  -2.90939449 -1.1461594 -0.34812636
C  -3.17855645 -2.41995241 0.16407093
C  -4.48357384 -2.91207547 0.20623325
C  -5.55346214 -2.15459686 -0.2654513
H  -6.10563999 -0.26654681 -1.13822955
H  -3.79662085 0.63257976 -1.16740585
H  -2.3728394 -3.05372342 0.53841826
H  -4.67107555 -3.9061653 0.61684739
B  -0.37642199 -3.18799107 -1.73576891
O  0.44899064 -4.21748866 -2.11472581
H  0.14884566 -4.60439551 -2.94734489
O  -1.3821707 -2.81191114 -2.54965262
H  -1.97365113 -2.1486108 -2.14303148
Pd -0.99779822 -0.41168166 -0.47907158
P  1.23682446 0.59846672 -0.92804502
C  1.26467087 1.51910092 -2.51294908
C  2.43326827 1.66787842 -3.26926151
C  0.07298795 2.09698342 -2.9654768
C  2.41128577 2.38512708 -4.45995345
H  3.3641623 1.21320523 -2.92796993
C  0.05854273 2.81416194 -4.15870021
H  -0.83437854 1.98523671 -2.36716531
C  1.22283274 2.95722654 -4.90651397
H  3.32454277 2.49512737 -5.04293978
H  -0.872265 3.25824964 -4.50804923
H  1.20509018 3.51274741 -5.84309966
C  2.59629937 -0.61158584 -1.15421888
C  3.69400708 -0.69896351 -0.29523267
C  2.47563669 -1.53595167 -2.19995156
C  4.65341378 -1.69196765 -0.48203972
H  3.79721016 0.00970185 0.52660669
C  3.43297842 -2.52489623 -2.38390581
H  1.63132956 -1.46317709 -2.88993719
C  4.5234945 -2.60711542 -1.52065793
H  5.50625338 -1.74884868 0.19278988
H  3.3224433 -3.23860257 -3.19922062
H  5.27203672 -3.38547901 -1.65850159
C  1.894855 1.77277731 0.31033076
C  2.68614845 2.87566004 -0.02320799
C  1.57606191 1.53503651 1.6493022
C  3.14438307 3.73041196 0.97419164
H  2.92972338 3.0779966 -1.06618375
C  2.03397161 2.39121376 2.64348473
H  0.93769389 0.69299565 1.91489267
C  2.81766302 3.49075544 2.30696756
H  3.7564485 4.59109167 0.70772401
H  1.74708207 2.21238948 3.67961054
H  3.16969686 4.16851662 3.08393316
C  -6.95508434 -2.68873652 -0.24516309
H  -7.27736094 -3.012432 -1.24531531
H  -7.04679597 -3.55380679 0.42339795
H  -7.67153204 -1.92704892 0.08967964
C  -0.27944064 -0.93150129 3.60802518
C  -0.33018569 -1.59906975 2.39101956
C  0.81520397 -2.18411728 1.8308727
C  2.01100001 -2.08456914 2.55687544
C  2.06606602 -1.40204507 3.76623629
C  0.92162376 -0.81334127 4.31115811
H  -1.18477646 -0.47663812 4.0134369
H  -1.28703967 -1.66389352 1.8726058
H  2.9151267 -2.53462449 2.14519885
H  3.01349574 -1.31605389 4.30036579
C  0.96731835 -0.08009407 5.61812042
H  1.9915102 0.21200334 5.88211057
H  0.34969283 0.82815563 5.58743561
H  0.58246614 -0.70129245 6.43934698
B  0.81614204 -2.9241095 0.46163913
O  -0.12995257 -2.5573558 -0.5218335
H  -0.26330973 5.29959189 3.7144038
O  1.71710599 -3.90319269 0.24557489
H  1.6609021 -4.27935382 -0.64871729
