program: Gaussian 09
title: 000038503
version: EM64L-G09RevD.01
frameworkgroup: C1[X(C18H17FN2O)]
method: RPBEPBE
basis: SDD
operation: Freq
keyword: #p
keyword: freq=noraman
keyword: PBEPBE/SDD
title: #p freq=noraman PBEPBE/SDD
converged: YES YES NO NO
title: Mulliken charges:
elementType: F O N N C C C C C C C C C C C C C C C C C C H H H H H H H H H H H H H H H H H
charge: -0.200918 -0.236637 -0.277751 -0.022375 -0.033893 0.373943 0.153113 -0.006379 -0.588758 -0.008553 -0.690365 -0.709058 -0.365510 0.476777 0.331603 -0.402574 -0.810146 -0.335370 -0.364292 -0.374770 -0.381722 0.324286 0.206017 0.244204 0.210649 0.273774 0.219946 0.219550 0.210947 0.277202 0.270919 0.239260 0.228219 0.236187 0.236834 0.283372 0.272783 0.260509 0.258980
chargesum: 0.00000
title: Mulliken charges with hydrogens summed into heavy atoms:
elementType: F O N N C C C C C C C C C C C C C C C C C C
charge: -0.200918 -0.236637 -0.277751 -0.022375 0.172124 0.373943 0.153113 -0.006379 -0.344555 -0.008553 0.014005 -0.001359 -0.094591 0.476777 0.331603 -0.163314 -0.108907 -0.051998 -0.091509 -0.114261 -0.122742 0.324286
polarizability: 3.12879224e+02 2.22030509e+00 2.52962513e+02 3.00044670e+00 1.43679175e+01 1.21787295e+02
1716.lowfreq: -13.5450 -6.1880 -2.9726 0.0005 0.0008 0.0009 32.6542 49.2538 52.0899
frequency: 32.2713 49.0201 52.0789 56.1726 67.0959 79.8279 126.8258 139.2102 166.3585 181.3992 210.9084 223.6774 237.1599 246.3224 248.8748 274.3743 295.8305 300.6136 344.1683 387.2801 399.8149 412.2913 422.0267 445.4459 451.6740 474.1143 481.9222 511.4549 537.6634 586.2099 599.8534 623.7750 642.5490 661.2064 672.2855 708.4240 727.2921 738.8692 777.0010 790.1451 818.2808 828.5084 832.0100 845.8501 863.5877 878.4360 923.4766 928.4810 949.6329 952.1402 965.5924 968.7272 984.8252 993.7247 1006.5073 1026.3225 1045.4298 1069.8637 1108.5293 1139.1789 1144.0419 1157.6706 1166.6787 1177.2064 1190.5144 1204.2455 1216.1519 1286.8429 1295.9398 1307.5160 1319.9265 1340.5463 1369.9993 1373.5445 1375.4785 1392.2265 1395.7540 1398.8144 1407.0910 1411.5590 1456.8210 1466.4010 1467.7308 1471.0028 1483.5504 1490.7965 1498.2106 1501.0893 1509.9663 1568.7019 1591.2071 1593.1091 1610.0181 1625.1948 2980.0517 2987.4297 2993.9106 3025.7656 3058.8789 3078.9414 3083.8893 3090.2430 3108.0267 3127.3710 3135.2800 3152.4832 3163.8969 3164.5405 3167.9845 3177.5498 3182.8337
redmass: 4.5705 2.8989 1.4299 2.9002 3.0209 5.2870 4.3189 4.2826 3.5529 3.7185 2.4619 2.0700 2.3274 1.3463 4.4287 3.7956 3.2037 5.7943 5.6374 4.6484 4.0888 3.4445 4.0498 3.4376 3.2476 4.1829 5.8441 3.6571 4.0408 4.3923 5.9118 6.5862 5.0361 4.1609 6.5760 5.0629 7.8262 4.6282 3.9091 6.3751 1.3136 1.6894 2.6691 1.7589 1.6251 2.7660 2.2724 1.5976 1.4393 1.3911 1.7422 1.6393 1.3326 2.4146 2.7249 2.1179 1.5782 4.0920 1.3279 1.9601 2.2820 1.5173 2.6675 1.8823 2.0194 2.3334 2.2390 1.6028 1.3175 1.8761 2.2036 3.9045 1.3654 4.7189 1.3026 1.2770 2.3956 1.7089 3.9168 2.8094 1.0444 1.1751 1.0978 1.1327 1.0582 2.6044 2.4077 1.2320 3.6199 7.3685 8.4130 7.8408 6.5944 6.5896 1.0375 1.0359 1.0380 1.0833 1.0972 1.0999 1.0992 1.0990 1.1001 1.0989 1.0885 1.0895 1.0889 1.0925 1.0930 1.0965 1.0977
irintensity: 1.3009 0.1868 0.2737 0.6191 0.5507 2.4386 0.9666 1.1624 0.7435 0.5504 0.5260 0.3674 1.5770 0.7916 4.4842 2.9672 0.4872 2.5570 0.7267 2.1192 4.8176 0.1986 1.2710 7.3176 0.6979 6.6460 4.6011 5.6168 13.9853 0.9277 24.9722 2.4230 1.6082 10.8585 3.5431 2.1147 10.2284 4.1193 29.1475 11.6638 14.2503 8.5288 15.8778 63.6397 6.5528 1.1763 14.9611 8.1866 0.6302 0.4469 5.0409 11.6203 4.0480 10.5184 11.2193 15.3357 12.3614 52.9807 10.1485 45.6526 14.2587 90.2984 80.0100 14.6089 4.1240 25.7997 2.4900 18.6037 4.8739 15.3711 80.5645 172.6215 5.3337 40.1283 18.9873 69.7159 21.7438 3.4579 19.4788 6.5019 1.6927 35.9754 20.0204 30.3203 5.5800 60.2853 57.1077 18.8887 124.1072 100.1259 549.4373 6.3814 114.7176 68.8322 25.7663 28.3156 28.6086 17.4046 15.0576 19.7323 56.5893 18.2512 6.6306 7.5306 8.8285 7.8148 0.6118 14.2032 4.4409 3.1852 4.3685
temp: 298.150 k
press: 1.00000 atm
elementType: 9 8 7 7 6 6 6 6 6 6 6 6 6 6 6 6 6 6 6 6 6 6 1 1 1 1 1 1 1 1 1 1 1 1 1 1 1 1 1
symmnumber: 1
zpe: 804232.7 jmol-1
zpe.correction: 0.306316 hartree
zpe.thermalcorrener: 0.326070 hartree
zpe.thermalcorrenthalpy: 0.327014 hartree
zpe.thermalcorrgfe: 0.257622 hartree
zpe.sumelectzpe: -979.152686 hartree
zpe.sumelectthermal: -979.132932 hartree
zpe.sumelectthermalent: -979.131987 hartree
zpe.sumelectthermalfe: -979.201380 hartree
dipole: 3.3439 5.9689 1.1292
dipole: 6.9343
quadrupole: -124.3723 -130.4923 -128.3507
quadrupole: 6.1216 5.0541 -1.1112
quadrupole: 3.3661 -2.7539 -0.6122 6.1216 5.0541 -1.1112
hfenergy: -979.4590016 hartree
pointgroup: C01 [X(C18H17F1N2O1)]
dipole: -1.2748623 2.3225228 -0.650835 debye
polarizability: 312.7216564|-4.3882792|248.6703057|-2.9804085|-27.6811596|126.2370702 unknown
InChI: InChI=1S/C18H17FN2O/c1-11(2)21-16-10-12(3)4-9-15(16)17(20-18(21)22)13-5-7-14(19)8-6-13/h4-11H,1-3H3
charge 0 multiplicity 1
39 atoms
F  6.242829 -0.224086 -0.419254
O  -1.726389 -2.968188 1.056445
N  -2.145784 -0.874568 0.065373
N  0.113249 -1.639246 0.490574
C  -3.57306 -1.246169 -0.242024
C  -1.718153 0.46541 0.01899
C  -0.311061 0.741194 0.16185
C  0.583671 -0.410701 0.255893
C  -2.625768 1.557409 -0.121364
C  -1.267694 -1.887773 0.590337
C  -4.41641 -1.327048 1.050859
C  -3.662512 -2.532038 -1.093738
C  0.119179 2.098156 0.229195
C  -2.177528 2.891271 -0.090754
C  2.062488 -0.305525 0.08569
C  -0.788597 3.154911 0.103422
C  -3.156244 4.041994 -0.229028
C  2.896575 -1.190339 0.823362
C  2.659363 0.588368 -0.845639
C  4.295806 -1.16601 0.667944
C  4.058482 0.617035 -1.024673
C  4.844891 -0.255718 -0.253324
H  -3.955421 -0.426577 -0.875977
H  -3.699305 1.376193 -0.213907
H  -5.475259 -1.516605 0.796825
H  -4.051219 -2.151408 1.684432
H  -4.360881 -0.386242 1.627988
H  -3.017006 -2.45923 -1.987472
H  -4.706751 -2.656155 -1.433944
H  -3.368133 -3.420271 -0.515832
H  1.177166 2.30795 0.410824
H  -0.439393 4.19142 0.167723
H  -4.197664 3.688884 -0.314007
H  -3.097123 4.722515 0.640616
H  -2.929832 4.646484 -1.127658
H  2.421819 -1.900355 1.506489
H  2.031056 1.234246 -1.466208
H  4.94963 -1.833537 1.23607
H  4.53168 1.286447 -1.748499
