program: Gaussian 09
title: Title Card Required
version: EM64L-G09RevD.01
method: RM06
basis: GenECP
operation: Freq
keyword: #N
keyword: Geom=AllCheck
keyword: Guess=TCheck
keyword: SCRF=Check
keyword: GenChk
keyword: RM06/GenECP
keyword: Freq
converged: YES YES YES YES
title: Mulliken charges:
elementType: C C C C C C H H H H Pd P C C C C O C C C C H C H C H H H C C C C H C H C H H H C C C C H C H C H H H C C C C H C H C H H H C C C C C C H H H H O O B O H O H C H H H C H H H C C C C H C H C H H H H
charge: 0.193097 -0.195575 -0.168993 0.117282 -0.169864 -0.217459 0.160467 0.190736 0.142553 0.140012 -0.243521 0.508128 0.212160 -0.225098 0.102161 0.232623 -0.481702 -0.098579 -0.166506 -0.179737 -0.148181 0.160318 -0.163034 0.231774 -0.163354 0.159642 0.165651 0.158164 -0.084485 -0.161537 -0.175996 -0.150083 0.174087 -0.148471 0.166313 -0.158385 0.167247 0.164380 0.163459 -0.095092 -0.164034 -0.137941 -0.153074 0.161375 -0.145499 0.169017 -0.156039 0.160357 0.175029 0.163759 0.074168 -0.178307 -0.136830 -0.164668 0.167886 -0.162110 0.151223 -0.151117 0.160039 0.149936 0.158648 -0.238746 -0.178082 0.338836 -0.185996 -0.253762 0.461824 0.134550 0.139682 0.146244 0.135901 -0.664093 -0.508497 0.592339 -0.619814 0.414609 -0.625999 0.415887 -0.592884 0.175340 0.216192 0.193697 -0.605572 0.187044 0.161552 0.182336 0.103413 -0.152456 -0.177861 -0.167556 0.195597 -0.164020 0.173437 -0.150308 0.168603 0.163278 0.162351 0.166514
chargesum: 0.00000
title: Mulliken charges with hydrogens summed into heavy atoms:
elementType: C C C C C C Pd P C C C C O C C C C C C C C C C C C C C C C C C C C C C C C C C C C C C O O B O O C C C C C C C C
charge: 0.193097 -0.035108 0.021743 0.117282 -0.027311 -0.077447 -0.243521 0.508128 0.212160 -0.225098 0.268674 0.232623 -0.481702 -0.098579 -0.006188 0.052038 0.011461 0.002617 -0.005190 -0.084485 0.012550 -0.009683 0.017164 0.015910 0.005074 -0.095092 -0.002659 0.031076 0.007283 0.029530 0.007719 0.074168 -0.010420 0.014393 -0.004629 -0.012174 0.007531 -0.104197 -0.038400 0.338836 -0.039751 -0.117860 0.461824 -0.664093 -0.508497 0.592339 -0.205205 -0.210112 -0.007654 -0.074640 0.103413 0.043142 -0.004424 0.001046 -0.000743 0.012043
1716.lowfreq: -412.9832 -5.0792 -0.0007 -0.0003 0.0010 6.8240 8.6182 12.3264 20.1373
redmass: 1.8212 6.5647 6.1656 6.1327 5.5416 5.6154 6.1171 4.5908 5.4187 4.7006 4.7268 5.8098 5.2079 4.6505 5.6382 5.2899 5.9175 4.5805 3.9135 5.2397 4.6514 5.1463 5.6667 5.5045 4.4945 5.7078 5.8017 4.5695 4.9408 4.4158 3.5512 1.4650 5.1675 4.6908 4.5683 5.1502 6.9625 5.7689 4.2755 6.6958 4.6821 3.0606 2.0690 4.4168 5.3508 4.6835 4.4118 1.1074 2.2326 5.0626 3.7407 5.9855 3.5337 6.1068 5.2174 5.0748 3.9393 2.9948 3.0683 2.9823 3.0480 3.0774 3.3043 6.4276 3.6000 4.7223 4.6463 4.7249 5.3488 1.3466 2.9632 4.9720 3.6734 5.0123 3.2746 4.2931 5.6362 3.9147 4.3371 4.5489 5.4290 5.7076 6.3687 6.3229 5.8909 6.4041 5.0538 6.1912 7.8727 6.0346 9.1689 6.1673 4.5039 5.5768 2.1681 2.0504 1.9763 2.0072 2.4604 3.7455 4.2490 5.9744 3.3773 2.3961 1.6212 1.6288 1.7572 5.6795 3.3472 2.0892 1.3114 2.7556 2.6434 1.7580 1.7861 1.2544 1.2495 1.2403 1.2417 1.3647 1.2552 4.4130 1.6774 1.2090 1.2679 1.4483 1.3934 1.3657 1.3505 1.3612 5.0437 1.3419 1.2844 1.3530 1.3314 1.5979 1.6552 1.3407 1.2932 1.2660 1.5815 1.3286 1.3639 5.1866 1.2993 5.1441 5.6418 4.1100 4.7500 1.6332 2.1422 2.3906 2.4657 1.2934 2.2254 1.4801 2.1406 2.5628 2.5495 2.7831 1.5490 1.7393 1.4681 1.5504 1.4993 1.5089 1.2058 1.6033 1.5368 2.6748 2.7311 2.8799 2.9671 1.3286 1.1173 1.0813 1.0771 1.0791 1.0792 1.1186 3.1298 1.1452 1.2087 1.1200 1.1261 1.4301 1.1502 2.3203 2.5910 2.8612 3.0046 1.6030 1.4834 1.4131 3.9260 1.6166 1.6665 1.4846 1.8636 4.4063 5.2983 4.7057 3.8421 5.3389 2.8456 6.1520 5.2834 1.4947 1.8790 6.1843 3.6272 2.2668 2.8104 3.9403 2.3489 2.3477 2.3571 2.1434 1.1675 1.9891 1.1263 1.1934 1.1053 5.6043 2.2440 2.1838 2.0926 2.6430 2.9622 3.4977 3.0320 7.6976 6.3549 6.1291 5.8706 6.0260 5.9083 6.4883 5.6981 6.1323 7.1789 6.2930 6.4295 6.9131 6.9752 6.4846 1.0316 1.0387 1.0394 1.0990 1.0984 1.0887 1.1020 1.1014 1.0943 1.0893 1.0893 1.0896 1.0877 1.0906 1.0848 1.0848 1.0868 1.0867 1.0854 1.0892 1.0879 1.0927 1.0857 1.0896 1.0935 1.0917 1.0935 1.0907 1.0953 1.0945 1.0948 1.0985 1.0960 1.0949 1.0918 1.0984 1.0955 1.0974 1.0983 1.0926 1.0672 1.0665
irintensity: 88.2000 0.4062 0.2216 0.2344 0.5145 0.8354 2.3260 1.0742 0.0815 0.1968 0.1636 0.3139 0.3837 0.4125 0.9518 0.4748 0.6782 0.5573 0.4576 0.5019 0.4728 2.1073 0.3767 4.3112 1.3540 3.1864 0.4955 1.8136 1.8230 1.7934 2.1512 1.3880 1.0739 0.9406 0.0862 6.9145 1.5511 5.6450 4.7146 0.0804 0.3991 1.0655 1.2463 2.4610 1.2917 0.5313 0.5531 1.8553 1.2212 0.8672 2.0332 1.1807 1.2449 3.5418 1.3206 20.3414 0.8391 0.1171 0.5040 0.0345 0.6759 0.2840 2.7659 4.5321 2.4154 3.8387 6.9878 0.3807 11.9841 162.8810 40.4247 28.4033 4.7313 42.8134 23.1696 0.5940 124.2009 7.2096 12.8237 19.7294 2.5217 1.8536 0.2377 2.5335 0.2822 0.4847 2.2282 1.7071 21.3967 8.4724 29.1606 15.0186 20.2015 4.0662 20.3794 28.6480 29.5741 16.1441 28.9665 6.6583 26.8230 17.4750 23.4961 50.9485 22.4319 2.6728 17.1268 30.1277 4.0832 20.4114 7.8769 32.3995 7.7716 49.2865 27.8598 0.0434 0.4573 0.7627 0.6204 0.9399 3.7735 13.5007 45.7416 137.4677 61.3247 1.9773 9.1297 0.9931 3.3310 0.8128 9.7087 1.1715 0.9506 0.0422 0.4321 9.1187 11.4099 2.1811 0.8753 0.1442 19.2938 1.9113 1.5132 1.5604 1.0729 5.3606 1.4924 1.5034 0.2287 5.1655 2.2506 4.3363 17.6174 4.9485 4.5571 152.2141 5.0162 1.6369 0.7301 1.8234 29.0984 1.1547 3.8070 15.8759 4.5930 0.7912 12.0632 1.2409 1.1466 13.8880 6.7639 21.4069 33.1953 1.5349 2.4482 0.3030 0.6347 0.1476 0.4205 2.7736 24.9629 1.2210 0.9169 3.3699 3.0122 12.0127 10.1864 13.3694 4.0404 169.5969 53.3975 76.3415 4.5622 4.3651 4.8258 2.7947 10.2112 4.1775 0.4754 25.5283 6.3879 0.5645 20.2958 4.0463 13.3865 17.8210 201.7459 69.3007 2.6160 501.4728 6.3498 7.7189 11.8772 38.0809 26.6727 11.6847 26.7881 3.2744 21.8769 14.8468 13.2111 9.3837 13.9316 1008.3435 4.8189 2.3022 13.2894 30.8875 11.3380 461.5976 47.5128 2.9859 1.2224 4.9766 2.5437 0.7611 3.8306 2.5111 0.7497 0.7500 9.0830 5.3273 3.2935 1.9117 36.9653 10.6700 38.2198 12.1186 51.4873 6.1275 12.7295 39.8464 18.3612 8.1175 63.4472 1.9486 22.3490 7.1389 2.1496 11.2206 0.9181 4.3550 16.4487 0.8167 1.5686 3.6431 11.4382 16.5192 0.1755 3.6033 5.6243 13.7202 15.2238 14.2160 20.4491 17.5660 26.9902 29.8025 35.8849 26.8098 8.7652 32.5369 14.5545 20.8684 21.5808 5.2670 24.7948 115.6095
temp: 298.150 k
press: 1.00000 atm
elementType: 6 6 6 6 6 6 1 1 1 1 46 15 6 6 6 6 8 6 6 6 6 1 6 1 6 1 1 1 6 6 6 6 1 6 1 6 1 1 1 6 6 6 6 1 6 1 6 1 1 1 6 6 6 6 1 6 1 6 1 1 1 6 6 6 6 6 6 1 1 1 1 8 8 5 8 1 8 1 6 1 1 1 6 1 1 1 6 6 6 6 1 6 1 6 1 1 1 1
symmnumber: 1
zpe: 2030213.7 jmol-1
zpe.correction: 0.773268 hartree
zpe.thermalcorrener: 0.824454 hartree
zpe.thermalcorrenthalpy: 0.825398 hartree
zpe.thermalcorrgfe: 0.683812 hartree
zpe.sumelectzpe: -2721.163236 hartree
zpe.sumelectthermal: -2721.112049 hartree
zpe.sumelectthermalent: -2721.111105 hartree
zpe.sumelectthermalfe: -2721.252691 hartree
dipole: -3.3647 -3.4784 2.1070
dipole: 5.2782
quadrupole: -292.3271 -322.4949 -322.5759
quadrupole: -27.2406 7.9656 -6.4755
quadrupole: 20.1388 -10.0289 -10.1099 -27.2406 7.9656 -6.4755
hfenergy: -2721.9365032 hartree
pointgroup: C01 [X(C48H42B1O5P1Pd1)]
dipole: -1.3225621 -1.3733477 0.8228297 debye
polarizability: 737.4707162|23.9226202|586.0340985|23.1132683|-48.7376741|495.6778267 unknown
InChI: InChI=1S/C24H20O.C18H15P.C6H6BO4.Pd.H/c1-17-13-15-19(16-14-17)22-18(2)23(20-9-5-3-6-10-20)25-24(22)21-11-7-4-8-12-21;1-4-10-16(11-5-1)19(17-12-6-2-7-13-17)18-14-8-3-9-15-18;8-5-1-3-6(4-2-5)11-7(9)10;;/h3-16H,1-2H3;1-15H;1-4,9-10H;;/q;;-1;+1;
charge 0 multiplicity 1
98 atoms
C  4.30105173 -2.9778455 -1.13217071
C  3.6624759 -1.92572117 -1.79099182
C  2.30742756 -1.69320294 -1.62189505
C  1.54173024 -2.48270821 -0.75278286
C  2.17543358 -3.55412273 -0.10971605
C  3.53071567 -3.79249442 -0.30194084
H  4.24231946 -1.24738001 -2.41921154
H  1.84094436 -0.83861415 -2.10589019
H  1.60983647 -4.21626718 0.54371104
H  4.00379726 -4.63089473 0.21148727
Pd -0.26106616 -0.11167888 0.18045161
P  -1.48199367 1.81386263 0.65485963
C  -0.87969665 -2.04598688 -1.61928863
C  0.10266102 -2.19412659 -0.55578585
C  -0.69635507 -2.50273582 0.61627791
C  -2.09756206 -2.36670201 -1.08746704
O  -1.98112508 -2.77591368 0.21622178
C  -2.52124447 2.03987225 -0.84240663
C  -3.91030259 2.1717857 -0.79967278
C  -1.85946601 2.05687575 -2.07942812
C  -4.63423206 2.32048214 -1.98101378
H  -4.43384614 2.15687711 0.15627569
C  -2.58958464 2.21260172 -3.25201391
H  -0.77235249 1.93603844 -2.10392646
C  -3.97687818 2.34498467 -3.20626969
H  -5.71814765 2.41856933 -1.93893739
H  -2.07058164 2.22984421 -4.20967281
H  -4.54469037 2.46654185 -4.12822274
C  -2.69612568 1.784671 2.02131395
C  -3.40439806 0.59795638 2.24264612
C  -2.96647105 2.90058722 2.81555876
C  -4.3769412 0.5344871 3.2320474
H  -3.19080257 -0.27994926 1.62686475
C  -3.93096024 2.82940911 3.81728891
H  -2.41848281 3.82848762 2.65357527
C  -4.63835869 1.65047091 4.02438298
H  -4.92498152 -0.39231311 3.39278875
H  -4.13039395 3.70210818 4.43707616
H  -5.39241074 1.59674972 4.80799136
C  -0.58398818 3.39301103 0.79185335
C  -1.17143328 4.60611996 0.41416725
C  0.74017383 3.37665786 1.23023644
C  -0.43940198 5.78485056 0.48487546
H  -2.20110766 4.62288969 0.05339044
C  1.47883507 4.55396792 1.27843932
H  1.21214685 2.43031929 1.49022381
C  0.88779696 5.75770494 0.90963111
H  -0.89924965 6.72667233 0.18940224
H  2.52390495 4.51888476 1.58226086
H  1.46651109 6.67966009 0.93915568
C  -3.45225221 -2.30849526 -1.61753914
C  -4.40055813 -3.27457628 -1.25610894
C  -3.83267633 -1.2628436 -2.46830106
C  -5.69197151 -3.21106305 -1.75978895
H  -4.11050397 -4.07933323 -0.58248791
C  -5.12770337 -1.20497441 -2.96873932
H  -3.1212398 -0.47047038 -2.70582602
C  -6.0579757 -2.17959407 -2.62228045
H  -6.41913389 -3.97129217 -1.47902351
H  -5.41137062 -0.37732639 -3.61753318
H  -7.07250389 -2.13114269 -3.01457691
C  2.81901635 0.88681575 0.2413184
C  4.1585071 1.15998795 0.4883788
C  4.90919751 1.86187821 -0.44680352
C  4.30402349 2.30187495 -1.61975522
C  2.96557756 2.02965321 -1.86539975
C  2.17560572 1.30704908 -0.94420834
H  2.23882875 0.30082958 0.96187501
H  4.63310342 0.81530596 1.40678459
H  4.90131904 2.86336267 -2.33758788
H  2.49209141 2.36618097 -2.78741967
O  0.92193804 1.02892494 -1.22911799
O  6.23151514 2.18570285 -0.21560829
B  7.21068519 1.26521599 -0.03470436
O  8.44955912 1.77282983 0.26441156
H  9.14139418 1.11159142 0.35064041
O  6.93636046 -0.07733003 -0.15635203
H  7.68693198 -0.64851676 0.03219177
C  -0.58858001 -1.6606552 -3.02768625
H  -1.44064872 -1.87846759 -3.68193935
H  -0.35329233 -0.58809692 -3.10261929
H  0.2847721 -2.20936843 -3.40467579
C  5.76673357 -3.21872852 -1.32951358
H  6.32050803 -2.2722728 -1.27835887
H  6.16993031 -3.90310117 -0.57222916
H  5.9710739 -3.66212819 -2.31477
C  -0.26419416 -3.18636433 1.85545413
C  0.68713886 -2.59579313 2.69061679
C  -0.7706791 -4.4483327 2.17015567
C  1.14913452 -3.2738552 3.8096191
H  1.06289985 -1.60029881 2.4468899
C  -0.31240206 -5.1195006 3.29892301
H  -1.51420521 -4.9054567 1.52046774
C  0.6515272 -4.53860208 4.11626499
H  1.89523437 -2.80925934 4.45153039
H  -0.70996084 -6.10455901 3.53745309
H  1.01010445 -5.06702459 4.99790394
H  -1.0286826 -1.10230795 1.20909402
