program: Gaussian 09
title: Title Card Required
version: EM64L-G09RevD.01
method: RM06
basis: GenECP
operation: Freq
keyword: #N
keyword: Geom=AllCheck
keyword: Guess=TCheck
keyword: SCRF=Check
keyword: GenChk
keyword: RM06/GenECP
keyword: Freq
converged: YES YES NO YES
title: Mulliken charges:
elementType: C C C C C C H O H O H H C C C C C C H H H H B O H O H Pd P C C C C H C H C H H H C C C C H C H C H H H C C C C H C H C H H H C C C C C C H H H H C H H H B O H O H P C C C C H C H C H H H C C C C H C H C H H H C C C C H C H C H H H C H H H
charge: -0.188434 -0.197310 0.441272 -0.232788 -0.233156 0.344984 0.134961 -0.688263 0.149399 -0.670377 0.118852 0.130411 -0.178058 -0.179478 -0.005571 -0.188435 -0.173667 0.163827 0.134591 0.126719 0.151025 0.134623 0.624701 -0.672345 0.455317 -0.635773 0.424593 -0.271028 0.553679 -0.116347 -0.162813 -0.174258 -0.154728 0.165777 -0.155476 0.228766 -0.154231 0.161562 0.162630 0.161095 -0.090946 -0.187741 -0.160360 -0.148788 0.166496 -0.135922 0.179593 -0.160156 0.161256 0.161096 0.160470 -0.069033 -0.157936 -0.165849 -0.132870 0.163324 -0.143084 0.151092 -0.148005 0.165155 0.159274 0.167245 -0.189413 -0.229383 0.064878 -0.206007 -0.190954 0.174044 0.134539 0.137789 0.160438 0.137328 -0.597389 0.185957 0.174350 0.170659 0.482357 -0.480009 0.424041 -0.653032 0.464186 0.537602 -0.129537 -0.213820 -0.160327 -0.170047 0.248054 -0.150548 0.177165 -0.149293 0.182470 0.168963 0.172431 -0.067361 -0.163376 -0.189526 -0.139637 0.156731 -0.145682 0.172877 -0.157763 0.162097 0.161918 0.160600 -0.080641 -0.155032 -0.155096 -0.153861 0.159052 -0.154030 0.158341 -0.156583 0.161070 0.183878 0.168645 -0.592550 0.168248 0.177941 0.171685
chargesum: 0.00000
title: Mulliken charges with hydrogens summed into heavy atoms:
elementType: C C C C C C O O C C C C C C B O O Pd P C C C C C C C C C C C C C C C C C C C C C C C C C B O O P C C C C C C C C C C C C C C C C C C C
charge: -0.039035 -0.062349 0.441272 -0.102377 -0.114304 0.344984 -0.264222 -0.670377 -0.043467 -0.052758 -0.005571 -0.037410 -0.039044 0.163827 0.624701 -0.217028 -0.211181 -0.271028 0.553679 -0.116347 0.002964 0.054508 0.006834 0.007154 0.006864 -0.090946 -0.021245 0.019233 0.012468 0.025174 0.000314 -0.069033 0.005389 -0.014757 0.032286 0.016190 0.019240 -0.054874 -0.091594 0.064878 -0.045569 -0.053626 0.174044 -0.066424 0.482357 -0.480009 -0.188846 0.537602 -0.129537 0.034234 0.016838 0.012423 0.018415 0.023138 -0.067361 -0.006644 -0.016648 0.022460 0.016236 0.002836 -0.080641 0.004020 0.003245 0.007209 0.029848 0.012062 -0.074675
1716.lowfreq: -0.0014 0.0012 0.0015 2.4437 3.5020 6.2583 12.0621 16.5436 23.5063
redmass: 5.5441 5.5857 6.2656 5.6054 5.9148 5.6553 5.3648 4.4427 4.9415 4.8133 4.8364 5.3174 4.5410 6.1444 5.6074 5.8010 5.8278 5.0238 4.4671 4.7937 4.6170 4.7154 4.4672 5.3967 1.3422 3.1050 4.3532 5.3171 5.8671 4.6903 5.7016 6.8287 3.1626 1.9299 2.3422 3.8517 4.8374 5.4351 6.6909 5.3369 8.8679 6.9709 6.2331 6.2622 5.1141 4.8371 4.8753 5.7343 5.1421 6.0772 4.7829 6.0336 5.7975 5.6026 5.5992 5.4270 5.0113 9.1924 6.0030 4.5749 5.0155 5.0155 4.7775 3.3650 2.6730 3.9782 4.3058 4.6354 2.9565 2.9656 2.8887 2.9648 3.0804 2.9518 3.5337 4.4430 3.5538 4.9062 2.1805 7.2274 3.8926 5.8614 4.9061 2.7046 3.7166 1.9427 2.8929 5.3217 1.8956 4.3465 5.1644 3.3944 5.1943 5.3129 5.4481 7.7384 5.5092 2.4508 4.8380 5.3621 6.3158 6.3224 6.3623 6.3861 6.4058 6.3989 5.8563 6.9234 6.9490 6.1353 5.2860 1.9990 5.1275 2.7407 2.1574 3.2865 2.1442 2.6731 3.1863 3.8413 4.5507 4.3529 4.1374 5.4129 5.7003 5.2581 3.3792 1.6662 1.7462 1.7271 1.8422 1.4978 1.4258 1.1757 3.4380 1.3972 1.4026 4.2060 1.5273 4.6726 1.2680 1.4552 1.2984 1.2618 1.2680 1.2461 1.2591 3.3078 1.8008 2.5061 1.6536 1.2501 1.2765 1.3461 1.3415 1.3316 1.3228 1.3425 1.2624 1.3393 1.3719 1.3489 1.2814 1.3407 1.3030 1.3203 1.3117 1.3804 1.2675 1.3034 1.2531 1.3072 1.5309 2.0914 2.0053 3.2440 1.6953 3.9743 3.8352 4.1980 5.4553 1.9162 1.9389 1.4212 3.3197 1.3884 2.5868 2.6494 2.0555 1.7356 1.6386 2.6756 2.7020 2.8292 2.7793 1.3851 1.2217 2.8046 1.5966 1.4942 1.2795 1.5397 1.5568 1.5580 1.5591 2.6510 1.7123 1.3062 1.7201 2.7314 2.7603 2.7159 2.7883 2.7976 1.0795 1.1372 1.0803 1.0800 1.0732 1.0750 1.0770 1.2884 1.1075 1.2398 1.1332 1.2134 1.1499 1.1288 1.1396 1.1497 1.1335 2.6693 2.7309 2.3564 1.8161 1.4698 1.3560 1.5209 1.6411 1.7679 1.5657 1.7041 1.8237 4.1733 5.8560 3.6217 2.9455 3.9935 3.4929 3.1275 3.9348 3.9435 3.8658 3.2452 6.8361 1.3275 1.4527 2.2379 2.9127 6.0437 2.3166 2.3561 2.6900 2.8135 2.6030 2.4350 2.3654 3.7491 1.0480 1.0501 1.1810 1.0902 2.1276 2.4487 2.2183 2.1410 2.1944 2.2771 2.1826 3.4540 3.1064 6.2269 5.7581 6.5464 6.5685 5.8779 5.9423 5.9024 5.9962 6.0184 5.7364 5.8142 6.0200 6.1472 6.0438 5.9983 6.0618 6.7871 6.5656 1.0386 1.0387 1.1005 1.0996 1.1018 1.1026 1.0880 1.0852 1.0857 1.0954 1.0871 1.0882 1.0931 1.0938 1.0921 1.0873 1.0865 1.0886 1.0926 1.0873 1.0935 1.0857 1.0862 1.0873 1.0871 1.0859 1.0901 1.0861 1.0936 1.0886 1.0885 1.0903 1.0904 1.0910 1.0941 1.0918 1.0935 1.0941 1.0940 1.0938 1.0929 1.0987 1.0949 1.0987 1.0986 1.0990 1.0953 1.0967 1.0646 1.0646 1.0661 1.0656
temp: 298.150 k
press: 1.00000 atm
elementType: 6 6 6 6 6 6 1 8 1 8 1 1 6 6 6 6 6 6 1 1 1 1 5 8 1 8 1 46 15 6 6 6 6 1 6 1 6 1 1 1 6 6 6 6 1 6 1 6 1 1 1 6 6 6 6 1 6 1 6 1 1 1 6 6 6 6 6 6 1 1 1 1 6 1 1 1 5 8 1 8 1 15 6 6 6 6 1 6 1 6 1 1 1 6 6 6 6 1 6 1 6 1 1 1 6 6 6 6 1 6 1 6 1 1 1 6 1 1 1
symmnumber: 1
zpe: 2488271.8 jmol-1
zpe.correction: 0.947733 hartree
zpe.thermalcorrener: 1.010804 hartree
zpe.thermalcorrenthalpy: 1.011748 hartree
zpe.thermalcorrgfe: 0.846497 hartree
zpe.sumelectzpe: -3473.138390 hartree
zpe.sumelectthermal: -3473.075319 hartree
zpe.sumelectthermalent: -3473.074375 hartree
zpe.sumelectthermalfe: -3473.239626 hartree
dipole: 4.6361 0.5148 0.6898
dipole: 4.7154
quadrupole: -394.4716 -382.9418 -376.5622
quadrupole: 7.2506 -15.6747 -0.0022
quadrupole: -9.8131 1.7167 8.0963 7.2506 -15.6747 -0.0022
hfenergy: -3474.0861231 hartree
pointgroup: C01 [X(C56H52B2O6P2Pd1)]
dipole: 1.8317494 -0.192184 -0.2222999 debye
polarizability: 860.205094|-70.0198076|609.5362255|27.3862338|-15.0200267|655.3038705 unknown
InChI: InChI=1S/2C18H15P.C7H10B2O4.C7H7.C6H5O2.Pd/c2*1-4-10-16(11-5-1)19(17-12-6-2-7-13-17)18-14-8-3-9-15-18;1-6-2-4-7(5-3-6)8(10)13-9(11)12;1-7-5-3-2-4-6-7;7-5-1-2-6(8)4-3-5;/h2*1-15H;2-5,10-12H,1H3;3-6H,1H3;1-4,7H;/q;;;;-1;+1
charge 0 multiplicity 1
119 atoms
C  -2.7349562 1.21449854 0.72229431
C  -1.4373884 0.9598722 0.30312298
C  -0.98427701 1.3222345 -0.98193683
C  -1.91877616 1.951955 -1.82868576
C  -3.22142996 2.20888879 -1.41013913
C  -3.63582223 1.84729979 -0.13017153
H  -0.73593653 0.47784576 0.98464313
O  -4.90896271 2.06793401 0.33532089
H  -3.07230943 0.91441403 1.71482476
O  0.23723172 1.08432073 -1.42488218
H  -3.92606261 2.69655677 -2.08931148
H  -1.59553389 2.23034719 -2.832655
C  4.84911616 -1.04233932 2.50855547
C  3.69520082 -0.52234655 1.92261308
C  3.44922643 -0.66574954 0.55570263
C  4.40841297 -1.33848851 -0.20894274
C  5.56551072 -1.84554458 0.37522085
C  5.80364802 -1.71230502 1.74604904
H  5.01780882 -0.90721844 3.57891915
H  2.99605165 0.03128478 2.55455196
H  4.25547055 -1.4736046 -1.28162235
H  6.29640122 -2.36899056 -0.24566576
B  -4.47864562 -0.60654713 -2.00824966
O  -3.56252015 -1.38383159 -1.35337013
H  -2.75513808 -1.49613767 -1.87890284
O  -4.27451239 -0.28608626 -3.32275839
H  -4.99274709 0.2746375 -3.63848321
Pd 1.81039919 0.11488471 -0.33965322
P  2.57082583 2.33075233 0.00177981
C  2.83796454 3.37867772 -1.47308522
C  3.71781976 4.46506073 -1.41871627
C  2.13458962 3.11310671 -2.65392166
C  3.8982862 5.27403766 -2.53488005
H  4.26694933 4.67775851 -0.50166907
C  2.32082599 3.92990534 -3.76507332
H  1.42219224 2.28634552 -2.66933857
C  3.20197699 5.00550339 -3.70953887
H  4.58510158 6.11749908 -2.48552136
H  1.77158879 3.72128745 -4.68200426
H  3.34543688 5.63881919 -4.58382914
C  4.09475751 2.58415335 0.97717764
C  4.13798775 3.30352282 2.17182461
C  5.26571789 1.9875764 0.49460116
C  5.33005428 3.40286657 2.88632651
H  3.2374477 3.78692804 2.54867291
C  6.45264942 2.09283414 1.20454224
H  5.23995396 1.41456502 -0.43291462
C  6.48453446 2.79434874 2.40824801
H  5.3523677 3.96245563 3.8202428
H  7.35256685 1.61074636 0.82594106
H  7.41327497 2.86742745 2.97208534
C  1.21352958 3.11404489 0.93517845
C  0.35882282 4.04057978 0.33679891
C  0.9094865 2.63073758 2.21491241
C  -0.77573187 4.48253591 1.01073348
H  0.56465955 4.39900221 -0.67162964
C  -0.21142959 3.08915142 2.89241082
H  1.54852531 1.8757342 2.67735237
C  -1.06138306 4.01186472 2.28656039
H  -1.45023258 5.18501334 0.52442618
H  -0.43836424 2.70422875 3.88547268
H  -1.95697838 4.34982927 2.80487006
C  -9.5594789 1.03337131 -0.08554304
C  -8.30314343 0.60069942 -0.49378501
C  -7.38330409 0.06756379 0.41582198
C  -7.77437017 -0.0116224 1.7580469
C  -9.02774275 0.41940808 2.17012742
C  -9.9425759 0.94598561 1.25359055
H  -10.25969465 1.44724779 -0.81356201
H  -8.02397372 0.6735715 -1.54580877
H  -7.07095078 -0.41359467 2.48708241
H  -9.30944809 0.3540303 3.22269256
C  -11.30647875 1.38471676 1.69730024
H  -12.00628128 0.53747726 1.739542
H  -11.28059172 1.828835 2.70080537
H  -11.7358223 2.1247811 1.01018301
B  -5.9644556 -0.39449652 -0.03887977
O  -5.6266038 -0.21180125 -1.37515929
H  -5.4769965 2.32336102 -0.40583326
O  -5.140783 -1.01321116 0.84629028
H  -4.27763062 -1.19792377 0.43549819
P  0.84273385 -2.066675 -0.33363888
C  -0.21112117 -2.5267339 -1.75618179
C  -0.56144842 -1.55406542 -2.69955981
C  -0.69332502 -3.83469331 -1.89689462
C  -1.40513015 -1.88839817 -3.75976781
H  -0.19201262 -0.53272482 -2.57673218
C  -1.53356647 -4.15980528 -2.95511126
H  -0.41057585 -4.59762666 -1.17031987
C  -1.89473844 -3.18555812 -3.88391136
H  -1.70870005 -1.11845777 -4.46654829
H  -1.91446876 -5.17499042 -3.05199114
H  -2.56553564 -3.43707699 -4.70351716
C  1.99125095 -3.48643602 -0.21242599
C  2.3478396 -4.05715779 1.00996477
C  2.63132673 -3.91808918 -1.37955499
C  3.32929688 -5.04189519 1.0640671
H  1.86144038 -3.73096378 1.92839595
C  3.60577265 -4.90650885 -1.32393467
H  2.36451876 -3.47492303 -2.3404152
C  3.96043512 -5.46712849 -0.09960987
H  3.59924714 -5.47976615 2.02372691
H  4.09191863 -5.23828981 -2.2400763
H  4.72773035 -6.23829072 -0.05370131
C  -0.24621519 -2.16207544 1.13724224
C  0.27855905 -1.72374721 2.36080979
C  -1.59499979 -2.51860652 1.06608244
C  -0.52822348 -1.65288682 3.48942225
H  1.3238926 -1.41781967 2.42169726
C  -2.40341009 -2.43624014 2.19735267
H  -2.03747735 -2.83096506 0.12129537
C  -1.87384064 -2.00186183 3.4075984
H  -0.10731081 -1.31099042 4.43390626
H  -3.45896269 -2.69407328 2.12531389
H  -2.51246478 -1.92976863 4.28614022
C  7.04377516 -2.28289144 2.36866273
H  7.17983133 -1.92191052 3.39585416
H  7.00924821 -3.38135176 2.40896988
H  7.94379679 -2.01454451 1.79837583
