program: Gaussian 09
title: 000005843
version: EM64L-G09RevD.01
frameworkgroup: C1[X(C9H12N2O3)]
method: RPBEPBE
basis: SDD
operation: Freq
keyword: #p
keyword: freq=noraman
keyword: PBEPBE/SDD
title: #p freq=noraman PBEPBE/SDD
converged: NO YES NO NO
title: Mulliken charges:
elementType: O O O N N C C C C C C C C C H H H H H H H H H H H H
charge: -0.215295 -0.210952 -0.220582 -0.383078 -0.372188 0.100747 -0.455073 -0.463732 -0.400220 -0.411549 -0.389817 0.170091 0.152026 0.149671 0.246499 0.216725 0.214131 0.248189 0.206544 0.234326 0.252314 0.198378 0.210593 0.189383 0.365393 0.367477
chargesum: 0.00000
title: Mulliken charges with hydrogens summed into heavy atoms:
elementType: O O O N N C C C C C C C C C
charge: -0.215295 -0.210952 -0.220582 -0.017685 -0.004711 0.100747 0.008151 -0.001412 0.040650 0.039142 0.010159 0.170091 0.152026 0.149671
polarizability: 1.48124082e+02 -1.80912831e+00 1.11022305e+02 5.12615665e+00 -3.56641470e-02 8.51190911e+01
1716.lowfreq: -7.4840 -0.0004 0.0002 0.0004 2.4690 10.7157 23.1994 114.4164 131.1104
frequency: 21.6890 114.4148 131.1034 151.5450 163.3926 212.4684 244.9644 278.1608 292.0059 347.2887 365.3575 387.8205 438.8230 466.0608 484.1642 519.0183 586.3168 645.4542 659.3217 676.4240 696.5289 705.3212 762.1564 781.8187 791.5060 820.1437 844.0162 908.4675 926.8471 937.8443 947.6567 994.6343 1025.8789 1043.9255 1071.5197 1111.1985 1142.8708 1149.4879 1178.1068 1194.3449 1262.9516 1275.6197 1288.3517 1302.8861 1322.4162 1341.4977 1347.2046 1353.7641 1362.6746 1367.5280 1376.9086 1377.9219 1460.4894 1462.3112 1464.5567 1474.4677 1477.9808 1613.8805 1649.0930 1680.1609 2969.3569 2980.2722 2991.3658 2993.0334 3002.9465 3038.1572 3039.9869 3052.0313 3056.6461 3075.5272 3518.3166 3521.7641
redmass: 7.8503 3.3072 5.8749 12.0053 3.3283 3.7949 2.8068 2.7161 3.8539 2.7223 3.3620 9.1805 3.4113 3.8961 9.1057 1.8659 6.9816 4.4266 2.4300 2.2678 5.1451 6.4908 1.9031 1.4973 1.6825 1.9650 2.1631 3.0244 2.3821 1.5970 1.8951 3.5191 3.3308 2.2191 1.8725 1.8202 1.9715 1.8658 1.4798 3.5074 1.3516 1.2499 1.8517 2.1180 1.4545 1.4031 1.3900 1.4167 1.4177 9.5075 1.4343 2.1570 1.0870 1.0823 1.0858 1.0822 1.0987 6.7086 8.3718 5.6198 1.0635 1.0586 1.0611 1.0619 1.0637 1.0967 1.1030 1.1021 1.1029 1.1001 1.0763 1.0776
irintensity: 1.2277 0.1343 0.2431 10.5655 0.0119 0.2265 4.3383 2.0632 6.7407 11.6850 17.3247 2.2396 1.9289 25.6009 16.6175 4.0939 2.4246 1.2069 6.4393 24.1243 5.5187 0.5667 2.7582 42.1989 180.4418 2.4359 7.6122 5.8557 16.9577 9.0166 9.8756 2.4417 5.2633 7.6672 2.6350 0.3031 6.7275 2.6042 9.1520 39.3990 7.1557 17.3918 106.7313 207.6129 57.7131 1.5345 25.2483 0.6996 2.2142 237.5302 4.7889 8.5391 1.7092 9.1220 12.8161 31.1520 8.9467 315.5368 96.3208 612.7206 35.3175 13.8571 17.1093 38.3323 49.2241 45.6459 26.5611 10.8107 21.4569 32.6214 73.4559 54.0505
temp: 298.150 k
press: 1.00000 atm
elementType: 8 8 8 7 7 6 6 6 6 6 6 6 6 6 1 1 1 1 1 1 1 1 1 1 1 1
symmnumber: 1
zpe: 548620.2 jmol-1
zpe.correction: 0.208958 hartree
zpe.thermalcorrener: 0.221001 hartree
zpe.thermalcorrenthalpy: 0.221945 hartree
zpe.thermalcorrgfe: 0.170417 hartree
zpe.sumelectzpe: -684.335729 hartree
zpe.sumelectthermal: -684.323687 hartree
zpe.sumelectthermalent: -684.322743 hartree
zpe.sumelectthermalfe: -684.374271 hartree
dipole: -1.4220 -0.0278 0.8524
dipole: 1.6582
quadrupole: -89.6030 -91.4430 -80.1492
quadrupole: 0.3490 -2.6802 -0.4816
quadrupole: -2.5379 -4.3779 6.9158 0.3490 -2.6802 -0.4816
hfenergy: -684.5446877 hartree
pointgroup: C01 [X(C9H12N2O3)]
dipole: -0.5419131 -0.0358605 0.361438 debye
dipolederiv: -0.8104185 -0.1336849 -0.0828131 -0.3146457 -0.7898286 -0.1980055 -0.1527239 -0.1595839 -0.379041 -0.6218474 0.0515925 -0.0084239 0.1682456 -1.0552131 0.0591485 -0.0169979 0.0032697 -0.3301356 -1.3399968 0.1484263 -0.0611063 0.1639802 -0.5997078 -0.0137919 -0.0828831 -0.0087987 -0.3748603 -1.4901577 -0.4349108 -0.1477663 -0.1905629 -0.5674159 -0.0555534 -0.1523902 -0.0819841 -0.3386754 -1.0958565 0.6400167 0.0178737 0.3911832 -0.9645462 -0.022682 -0.0352334 0.013353 -0.3128522 -0.3582947 -0.0561391 0.0648266 -0.0694399 -0.2701735 -0.0295436 0.1935317 -0.0292196 -0.1196928 0.0997697 -0.04849 -0.0472364 -0.0058535 -0.0137742 -0.025141 -0.2448406 -0.0341189 0.2558887 0.1714836 -0.0428855 0.0367212 -0.0832312 0.0159199 -0.0285986 0.1010719 -0.0023459 0.125877 0.0456655 -0.0097008 -0.020424 -0.0046806 0.0945844 -0.0058862 0.0839378 0.0655594 0.0121616 0.042576 -0.0377332 0.0019232 0.0248047 0.0973624 0.0133018 -0.0316056 -0.0162934 0.0355613 0.0954341 0.0044034 -0.0070605 -0.0417054 0.1543348 0.0396956 -0.0160118 0.0241181 0.0460664 1.6408636 0.193646 0.1580044 -0.0979223 0.8388523 0.3187327 0.1611672 0.2793534 0.2767069 1.4307257 -0.3593892 -0.0209288 -0.0377127 1.1849302 -0.1272381 0.0371166 -0.0869027 0.1806604 1.9469338 -0.0485241 0.1241952 -0.0639432 1.6562739 0.1407044 0.2031077 0.1265213 0.3594072 0.0545692 0.0338054 0.0471563 0.011114 -0.0762258 -0.045631 0.0400745 -0.0283083 0.0404134 -0.1016165 0.0326795 -0.1118265 0.0387074 0.0555893 0.0610696 -0.0733409 0.035457 -0.0296123 -0.0095032 -0.0061116 0.0888124 -0.0007055 0.0838538 -0.0214732 0.0547391 0.0162779 -0.1395198 0.0591408 0.028293 -0.0071116 0.0441202 -0.0595979 -0.0063416 -0.0051336 -0.0497012 0.0780481 -0.0101552 -0.0205033 0.0764526 -0.0147101 0.080242 0.0039794 0.0673016 0.0236165 -0.1811593 0.0380098 0.0517136 -0.0207847 0.041784 -0.1040496 -0.0104668 -0.0464948 -0.063726 0.093307 0.1146767 0.0199099 0.0488344 -0.0351206 -0.0743752 -0.0654062 0.050621 -0.0306627 0.0427619 -0.1108896 0.0470487 -0.1200158 0.0779272 0.0447392 0.0864649 -0.1064633 0.0620828 -0.052649 -0.1688258 -0.0987987 0.0327378 -0.1425497 0.0136528 0.029712 0.0258903 0.0191159 0.0466533 0.0644343 0.0241415 -0.0059121 0.109529 -0.1555817 -0.0704286 0.0127188 -0.0485846 0.0030877 0.1413856 -0.0231881 -0.025572 -0.0329074 0.2230388 -0.0211743 -0.0451441 -0.0320429 0.3248823 0.1718935 0.0443832 -0.0105558 0.064295 0.1871156 -0.0054467 -0.0220152 0.0035477 0.3367143 unknown
polarizability: 148.4902276|-1.8093121|110.8960634|1.83467|1.7347455|84.879187 unknown
InChI: InChI=1S/C9H12N2O3/c12-6-9(4-2-1-3-5-9)7(13)11-8(14)10-6/h10-11H,1-5H2
charge 0 multiplicity 1
26 atoms
O  -0.483137 -2.10361 -0.751039
O  0.465765 2.599162 -0.061385
O  3.820798 -0.605076 0.097482
N  1.617611 -1.318473 -0.232461
N  2.09324 0.97095 0.056693
C  -0.324236 0.265782 -0.064553
C  -0.878078 0.215307 1.42641
C  -1.474813 0.687011 -1.038388
C  -2.173215 -0.611821 1.557884
C  -2.800262 -0.086033 -0.849026
C  -3.274988 -0.067794 0.62122
C  0.227744 -1.126416 -0.399516
C  0.748894 1.373762 -0.052323
C  2.598908 -0.338667 -0.00938
H  -1.081319 1.264532 1.71676
H  -0.090746 -0.170923 2.102959
H  -1.122237 0.580867 -2.082206
H  -1.645384 1.765562 -0.86344
H  -2.50681 -0.57011 2.612819
H  -1.976982 -1.674052 1.319083
H  -2.672744 -1.131164 -1.179893
H  -3.566273 0.377413 -1.500494
H  -4.19532 -0.671948 0.727914
H  -3.531062 0.969991 0.920206
H  1.96565 -2.274587 -0.36098
H  2.792196 1.714134 0.158752
