program: Gaussian 09
title: 000038636
version: EM64L-G09RevD.01
frameworkgroup: C1[X(C23H31N3O)]
method: RPBEPBE
basis: SDD
operation: Freq
keyword: #p
keyword: freq=noraman
keyword: PBEPBE/SDD
title: #p freq=noraman PBEPBE/SDD
converged: YES YES NO NO
title: Mulliken charges:
elementType: O N N N C C C C C C C C C C C C C C C C C C C C C C C H H H H H H H H H H H H H H H H H H H H H H H H H H H H H H H
charge: -0.236045 -0.236301 -0.087160 -0.077027 -0.012360 -0.468111 0.239792 0.075746 -0.361483 0.419271 0.230092 -0.377742 -0.431220 -0.396006 -0.368678 -0.407805 -0.364097 -0.264962 -0.208367 -0.358249 -0.602866 -0.606658 -0.246713 -0.265306 -0.243038 -0.624852 -0.616274 0.219687 0.229595 0.217824 0.202089 0.191205 0.192689 0.254659 0.202333 0.214306 0.268417 0.259618 0.265513 0.226658 0.225691 0.209176 0.173696 0.244895 0.239899 0.218791 0.220902 0.236233 0.243886 0.223566 0.224346 0.227270 0.217933 0.183375 0.232830 0.224926 0.184406 0.220004
chargesum: 0.00000
title: Mulliken charges with hydrogens summed into heavy atoms:
elementType: O N N N C C C C C C C C C C C C C C C C C C C C C C C
charge: -0.236045 -0.236301 -0.087160 -0.077027 -0.012360 -0.018829 0.239792 0.075746 0.058430 0.419271 0.230092 0.006152 -0.176561 0.020634 -0.100260 -0.148186 -0.098584 -0.038305 0.017324 0.024623 0.100718 0.094364 -0.023147 -0.040960 -0.015767 0.009286 0.013062
polarizability: 2.60940557e+02 -2.26841300e+01 2.73645252e+02 6.88473593e+00 1.54475799e+01 2.69473667e+02
1716.lowfreq: -3.8873 -0.0006 0.0000 0.0004 4.3787 7.2242 20.7378 23.5409 34.5227
frequency: 20.7161 23.3471 34.1953 36.0084 44.4542 53.2796 65.1140 82.4630 84.0278 86.7931 107.1694 128.7012 129.2634 140.4564 144.3055 169.9287 193.1246 209.6157 212.1899 214.7814 224.5990 228.1564 236.3121 250.1347 261.4435 301.3424 305.7292 328.5667 344.0419 360.5717 366.8661 378.8105 404.9821 434.1062 453.5477 481.8157 483.9058 491.4996 505.4672 519.1735 520.4067 597.9479 615.7463 618.5851 664.5630 683.5410 703.0735 712.8701 727.9359 740.8476 759.8927 766.2985 771.9680 791.9554 812.2346 828.1645 854.8615 876.8082 883.2612 898.6372 925.6851 935.1056 951.5428 972.5844 980.1572 983.9808 990.5366 995.1115 1000.8074 1004.6410 1008.7979 1016.5906 1029.4479 1031.4331 1034.3454 1056.2891 1067.9499 1079.9053 1080.9830 1083.1690 1085.0984 1095.5106 1100.7873 1108.9272 1135.1118 1138.0517 1151.2990 1163.3921 1169.0572 1173.2335 1181.2665 1195.8774 1203.2148 1211.4072 1226.6534 1237.6331 1241.6069 1262.4114 1267.5432 1285.5062 1289.2475 1294.0624 1304.2975 1310.1706 1315.1172 1321.4914 1342.2755 1358.1177 1374.3102 1377.5964 1403.9913 1409.9884 1416.9720 1430.9010 1433.5323 1441.0504 1450.8252 1452.7773 1454.2746 1459.9128 1461.6240 1463.7635 1466.0933 1471.0252 1471.8472 1475.7792 1477.9982 1481.2994 1482.7040 1484.7332 1489.8390 1495.0320 1587.6585 1600.6964 1607.9290 1618.7425 1642.6368 2812.4993 2836.4536 2853.8507 2953.4808 2953.9464 2958.4772 2969.4480 2977.3805 2986.7605 2996.7718 3001.0048 3015.3440 3025.6616 3028.6701 3046.8430 3056.3039 3058.4132 3058.8291 3074.6502 3086.8849 3097.4101 3103.8232 3122.4544 3126.2727 3132.9990 3137.3499 3149.1468 3157.4577 3158.6786 3167.0223 3172.4420
redmass: 4.2343 4.5317 2.4626 4.2213 3.7006 3.2381 3.5932 3.9500 2.6983 2.0447 3.8701 3.4001 3.0436 2.1808 3.1790 4.7239 3.5847 1.1882 1.2960 3.1009 1.6550 1.2099 1.8937 1.7075 3.7110 4.7137 3.9131 2.5721 3.1655 2.9165 3.1184 3.9445 2.8652 3.2063 2.6849 5.3220 3.6222 4.0012 3.6475 4.4187 4.3440 4.0175 5.9054 6.0143 4.4717 6.4808 2.5138 2.6972 1.4778 1.4812 1.6226 1.5040 1.9591 2.7908 4.1100 1.8299 1.2530 1.6082 2.2630 3.2943 1.4552 3.2931 1.4650 1.6306 1.3929 1.3517 3.9555 1.6554 2.8759 3.4004 1.7216 2.1229 2.0749 1.9410 2.6557 2.8505 3.3818 2.1303 1.9565 1.2579 1.6961 1.6883 2.0182 1.5218 1.6572 1.4975 1.8168 1.6621 1.2334 1.1070 2.7887 1.1653 1.7199 3.3563 2.4373 1.4860 2.1853 2.3475 1.6762 1.3593 1.0725 1.4729 1.2065 1.3657 3.5454 1.4383 1.4163 1.5988 1.4485 6.0277 4.9251 1.1447 1.1431 1.1864 2.2513 1.1662 1.0477 1.8249 1.3422 1.0709 1.0515 1.1129 1.0699 1.1544 2.4403 1.0671 1.0806 2.0507 1.0567 1.0786 1.0849 1.0549 6.0204 7.5420 6.1343 7.8973 9.6107 1.0700 1.0578 1.0579 1.0396 1.0587 1.0400 1.0598 1.0613 1.0601 1.0961 1.0864 1.0713 1.1007 1.0716 1.1034 1.0941 1.0954 1.1013 1.1010 1.0999 1.1014 1.1015 1.0846 1.0864 1.0888 1.0903 1.0930 1.0952 1.0950 1.0997 1.0977
irintensity: 0.0020 0.3831 0.5935 0.4630 0.0169 0.5263 0.2363 0.3845 0.2073 0.2350 0.3216 2.9540 0.6287 0.6652 3.3622 1.6155 0.7830 0.0553 0.4918 0.0184 0.9618 1.1543 0.5736 2.5258 5.0654 4.6915 0.7793 7.5807 1.9749 3.9936 4.4403 3.2748 0.1679 1.9583 5.1024 6.0354 4.9226 2.6742 6.7538 5.2988 2.6103 11.6451 5.0498 3.8619 5.9530 6.7993 24.8669 32.9527 3.8902 4.9052 6.8603 68.4364 40.2093 2.0463 19.8345 8.7673 1.7252 3.3367 7.2342 3.4359 2.4672 8.5745 4.2431 8.0398 0.2996 0.1003 0.1529 1.1741 8.0374 10.9661 12.0396 8.9710 4.9080 15.9841 35.5769 23.4675 9.3437 4.4458 1.4317 1.5821 14.1258 6.5438 8.8824 12.6945 7.7140 3.9947 2.2027 11.6383 7.0112 2.9927 63.6401 7.8883 13.0580 0.8410 2.2632 1.8826 21.8417 6.9499 13.0433 7.9644 0.7958 19.5029 4.9017 2.1447 13.7609 1.2918 1.0803 2.6529 11.0052 0.3945 2.5689 5.9050 2.1986 9.5158 10.2960 3.2674 8.5273 27.3875 14.1384 3.5371 18.3189 45.1073 2.1915 6.0268 38.0396 7.4114 7.9478 40.1043 6.9808 5.9922 24.5970 21.6457 0.7143 25.6221 20.1908 141.3933 68.8873 68.4616 72.6738 231.8852 45.1222 14.5522 57.2510 7.0525 24.4928 49.3164 9.7478 28.6348 46.3090 0.7112 44.6636 34.0906 9.7427 34.3214 77.9543 38.4523 48.0011 19.0043 38.3557 0.3340 1.2642 12.4390 18.9572 24.5796 9.8843 27.8976 20.9128 12.1059
temp: 298.150 k
press: 1.00000 atm
elementType: 8 7 7 7 6 6 6 6 6 6 6 6 6 6 6 6 6 6 6 6 6 6 6 6 6 6 6 1 1 1 1 1 1 1 1 1 1 1 1 1 1 1 1 1 1 1 1 1 1 1 1 1 1 1 1 1 1 1
symmnumber: 1
zpe: 1291550.0 jmol-1
zpe.correction: 0.491925 hartree
zpe.thermalcorrener: 0.519742 hartree
zpe.thermalcorrenthalpy: 0.520686 hartree
zpe.thermalcorrgfe: 0.431762 hartree
zpe.sumelectzpe: -1132.465642 hartree
zpe.sumelectthermal: -1132.437825 hartree
zpe.sumelectthermalent: -1132.436881 hartree
zpe.sumelectthermalfe: -1132.525805 hartree
dipole: -0.2455 0.7237 0.5633
dipole: 0.9494
quadrupole: -156.9826 -151.7986 -159.4336
quadrupole: 3.0119 5.9410 -4.3669
quadrupole: -0.9110 4.2730 -3.3620 3.0119 5.9410 -4.3669
hfenergy: -1132.957567 hartree
pointgroup: C01 [X(C23H31N3O1)]
dipole: 0.1129451 -0.2913921 0.2046082 debye
polarizability: 263.9781424|-22.771936|272.6994477|-7.367177|-15.8233294|267.3818854 unknown
InChI: InChI=1S/C23H31N3O/c1-24(2)18-12-6-11-17-23(19-13-7-5-8-14-19)20-15-9-10-16-21(20)26(22(23)27)25(3)4/h5,7-10,13-16H,6,11-12,17-18H2,1-4H3
charge 0 multiplicity 1
58 atoms
O  -0.919406 -0.137065 -2.465346
N  -1.260731 -1.799953 -0.812579
N  -1.345231 -2.964466 -1.630142
N  6.65446 0.655573 0.225897
C  -1.070874 0.448775 0.002551
C  0.259807 1.275586 0.038651
C  -1.16214 -0.564001 1.142745
C  -1.070462 -0.479665 -1.261606
C  1.554431 0.43456 0.04595
C  -2.284626 1.409275 -0.098184
C  -1.29026 -1.871639 0.60912
C  2.819364 1.321391 0.090344
C  -1.105814 -0.395116 2.535502
C  4.129351 0.501274 0.074972
C  -1.392145 -3.017189 1.414261
C  -3.30457 1.452201 0.885162
C  -2.382797 2.281443 -1.216371
C  -1.199698 -1.536109 3.376291
C  -1.348208 -2.828973 2.81842
C  5.379688 1.403903 0.094566
C  -2.535022 -2.925143 -2.524115
C  -0.063019 -3.245154 -2.334335
C  -4.383402 2.358982 0.767022
C  -3.460521 3.183736 -1.334654
C  -4.464808 3.232595 -0.339598
C  6.953007 -0.196546 -0.942839
C  7.78393 1.55397 0.542203
H  0.226648 1.925646 0.935665
H  0.266692 1.944092 -0.84266
H  1.557108 -0.252134 0.915172
H  1.589548 -0.197119 -0.865217
H  2.791592 1.954905 1.001821
H  2.808358 2.017365 -0.774636
H  -0.98683 0.602896 2.972606
H  4.132789 -0.145096 -0.825084
H  4.168391 -0.170467 0.954719
H  -1.492174 -4.006343 0.958601
H  -3.264498 0.772595 1.741293
H  -1.63176 2.225062 -2.011054
H  -1.157612 -1.414661 4.463968
H  -1.423456 -3.699089 3.480327
H  5.306617 2.084389 0.966112
H  5.377759 2.053817 -0.82282
H  -2.466294 -2.138321 -3.303501
H  -3.436737 -2.753738 -1.913696
H  -2.624658 -3.91231 -3.010362
H  -0.150618 -4.236071 -2.813175
H  0.751775 -3.288981 -1.592476
H  0.18265 -2.486762 -3.106184
H  -5.160941 2.377424 1.539408
H  -3.519859 3.844465 -2.207034
H  -5.301154 3.934897 -0.430391
H  7.902835 -0.734204 -0.771499
H  7.051267 0.384665 -1.896981
H  6.161143 -0.951377 -1.081788
H  7.566199 2.113515 1.469685
H  8.002836 2.298797 -0.266661
H  8.698879 0.9574 0.709957
