program: Gaussian 16
title: Title Card Required
version: ES64L-G16RevC.01
frameworkgroup: C1[X(C40H45CoNO5)]
method: RPBE1PBE
basis: def2SVP
operation: Freq
keyword: #P
keyword: Geom=AllCheck
keyword: Guess=TCheck
keyword: SCRF=Check
keyword: GenChk
keyword: RPBE1PBE/def2SVP
keyword: Freq
converged: YES YES YES YES
title: Mulliken charges:
elementType: C C C C C C C C N H H H H H C O C C H H H C H H H C H H H C H H H Co C C C C C C H H H C H H H C H H H C H H H C H H H O C O C H H H C O C C C C H C H C H H H C C C C C H C H C H H H O
charge: -0.008237 0.043839 0.149710 -0.054764 -0.016430 -0.010775 -0.307158 0.238536 -0.194207 0.047207 0.055144 0.066329 0.060625 0.146575 0.326085 -0.243304 -0.455723 -0.007295 0.057294 0.068328 0.058087 0.018458 0.049309 0.044500 0.048937 0.007688 0.064703 0.063877 0.069428 0.069872 0.113509 0.108594 0.114222 0.265348 -0.181304 -0.139310 -0.104652 -0.197521 -0.064962 0.060316 0.059682 0.070572 0.065792 0.077588 0.074836 0.057060 0.059395 0.064981 0.059056 0.067947 0.072895 0.058421 0.073166 0.068564 0.053697 0.065106 0.069507 0.073265 0.084680 -0.436517 0.230615 -0.433718 -0.067064 0.086485 0.062116 0.061138 0.184173 -0.527404 -0.064642 -0.035280 0.006751 -0.047880 0.068499 -0.026976 -0.015619 -0.025013 0.046562 0.045868 0.050919 0.299313 -0.098117 0.015699 0.007988 -0.048570 0.058241 -0.036795 0.040436 -0.016744 0.053159 0.054212 0.056838 -0.255760
chargesum: 1.00000
title: Mulliken charges with hydrogens summed into heavy atoms:
elementType: C C C C C C C C N C O C C C C C Co C C C C C C C C C C O C O C C O C C C C C C C C C C C C C O
charge: 0.038970 0.043839 0.149710 0.000380 0.049899 0.049850 -0.307158 0.385111 -0.194207 0.326085 -0.243304 -0.455723 0.176413 0.161203 0.205696 0.406197 0.265348 -0.181304 -0.139310 -0.104652 -0.197521 -0.064962 0.256363 0.268879 0.264879 0.253848 0.292558 -0.436517 0.230615 -0.433718 0.142675 0.184173 -0.527404 -0.064642 0.033220 -0.008867 -0.001319 0.018891 0.025906 0.299313 -0.098117 0.073939 0.048424 0.004588 0.017418 0.040094 -0.255760
polarizability: 7.58086627e+02 -1.17208130e+01 6.89493783e+02 -7.26220524e+01 -5.62406356e+01 5.92737872e+02
1716.lowfreq: -2.8120 -0.0030 -0.0027 -0.0013 7.9082 9.3866 19.8612 25.8666 34.3628
redmass: 4.3189 4.0105 4.7629 4.2011 3.8867 3.9375 3.1251 3.8467 4.5811 3.6710 4.5767 4.4968 1.9720 1.7012 3.8253 3.8305 3.4911 3.9420 1.0800 3.3046 3.2519 1.9862 2.2056 1.3901 3.2272 1.4392 1.2470 3.5343 2.2981 2.4936 4.3534 1.0854 3.5038 3.3305 3.0778 2.5837 1.9985 2.1673 3.3039 1.1059 4.4598 4.2827 2.6933 4.7232 3.5249 3.3506 1.5853 2.8221 3.1896 2.6948 3.0361 3.5390 3.5449 6.0247 7.2101 2.8496 2.7178 2.6589 5.2066 2.9363 3.2935 4.3590 3.9232 3.8146 4.0986 4.6231 6.8346 4.4507 5.0157 3.9695 3.8390 5.7977 4.1166 4.2907 4.0258 2.4913 7.0651 4.8129 5.9752 4.3999 3.8576 4.4979 5.0372 2.6137 6.1569 3.6468 3.5142 6.4511 6.5808 5.7868 1.5753 5.9065 4.1057 3.8827 1.4661 3.6814 1.9361 3.8336 2.0511 2.6670 3.3563 2.1684 2.1581 2.4372 1.2553 1.4022 3.0553 1.4762 2.5642 1.7981 1.4460 2.0097 1.4554 1.3612 3.3990 1.5640 2.2804 1.6912 1.6809 1.4368 1.6390 1.5414 3.6200 2.7036 1.5262 1.6288 1.5460 1.4754 1.3619 1.4682 1.5217 1.5033 1.3722 1.5776 1.9289 1.4578 1.9463 3.0087 2.0297 2.1773 2.8156 1.9171 1.8819 1.6994 1.7934 1.7975 1.4644 1.7823 1.9811 1.4774 1.0765 1.6049 1.0702 1.7650 1.8380 1.2928 1.1131 3.2346 3.3699 4.0703 3.2512 3.2179 2.8263 2.8803 3.0442 1.9243 2.0587 1.7328 1.3596 1.3642 1.3052 1.3645 1.2890 1.2420 1.2403 1.3238 1.2695 2.1355 6.7292 1.4530 6.5144 1.2937 1.1482 1.1248 1.1082 1.1437 1.6009 1.0797 1.0743 2.4629 1.0600 1.0678 1.0696 1.0396 1.0506 1.0596 1.0641 1.0616 1.0962 1.0695 2.2596 1.1538 1.1369 2.5279 1.1127 2.4647 4.2260 3.1109 3.8271 3.0349 2.4478 2.8182 5.9353 5.5039 6.7926 6.3512 6.5743 7.2542 11.0801 6.7781 6.5679 7.2672 12.2113 8.3510 12.8643 1.0416 1.0378 1.0407 1.0412 1.0432 1.0402 1.0378 1.0380 1.0392 1.0344 1.1027 1.1023 1.0992 1.1018 1.0962 1.1001 1.1044 1.1053 1.1024 1.1023 1.1047 1.1044 1.1047 1.1028 1.1014 1.1073 1.1047 1.1083 1.1010 1.0879 1.0877 1.0932 1.0918 1.0893 1.0964 1.0997 1.1009 1.1080 1.0949 1.0965 1.0987 1.0943 1.0928 1.1008 1.0900
irintensity: 0.5953 2.2659 0.9337 1.5430 0.6356 0.2842 0.5542 4.7735 0.4421 3.3844 2.2604 4.5362 4.4525 1.9365 1.9755 1.9497 5.0220 0.9628 0.3304 7.1574 3.0646 6.8089 8.2297 8.0688 4.7957 4.0612 0.5666 0.5266 9.5725 2.1400 3.7971 0.3015 9.3957 13.8772 1.4716 3.8177 0.5016 0.3700 2.4913 0.6212 1.0265 1.7462 3.0230 2.3646 12.7394 3.1240 2.4399 2.4546 5.0512 1.8735 2.6186 0.4016 13.1375 1.7627 15.6838 13.5422 0.9158 1.4406 9.5864 1.9427 13.7252 10.0541 0.0909 6.6185 10.6365 42.1898 36.5896 33.2694 0.8945 4.0956 10.9043 58.3036 5.5632 1.0073 27.9896 2.5841 84.4535 40.1843 19.9218 11.0376 9.0017 8.1827 3.0231 26.7206 1.0631 3.0469 12.0053 33.8597 52.0996 47.9121 139.1992 30.4281 5.6294 4.7320 53.3877 10.7505 5.1744 7.0955 99.3842 16.9709 15.9439 0.4296 1.5958 34.8694 10.2817 24.6590 81.3157 5.4946 56.7486 46.4254 10.7199 32.9048 2.1129 13.9935 14.6890 2.2832 40.8295 24.1698 12.8367 12.6770 12.0251 6.8547 8.0454 6.0664 82.8618 6.6181 7.0430 29.0835 1.0328 11.7814 1.7122 13.9066 0.8307 1.7538 24.8011 1.5613 10.5414 53.0033 24.0761 65.0236 55.2814 46.7069 18.8031 44.3524 37.2467 0.1949 13.4851 110.4574 246.2530 57.5057 5.1989 47.8079 2.8405 71.0334 58.7131 88.9338 12.0529 3.2122 12.1490 227.8251 3.3660 10.3247 4.8087 17.0273 58.3097 82.4791 49.1863 58.5127 1.9884 19.9052 8.4457 4.6022 4.9261 10.0716 25.2323 2.8083 13.5162 3.6782 2.6677 296.4663 2.3210 46.4874 6.6993 16.5835 0.2753 7.6541 7.4548 17.7686 19.1072 1.4707 3.0424 33.4232 0.7791 29.2848 3.8426 5.4585 11.9845 20.2166 60.5044 2.0639 374.3914 57.8538 24.1149 21.0242 57.3573 35.5079 7.8215 51.2622 13.8754 22.2726 21.0589 5.8197 12.4762 25.5104 60.8126 46.6907 13.8721 30.6189 821.2694 23.3588 30.6384 74.2849 690.2292 60.8415 409.8256 16.3496 23.6634 10.7535 15.7996 9.2125 6.9818 29.9908 1.8118 25.5032 0.8937 5.6523 2.7483 3.0223 19.4084 4.1616 2.0912 24.7941 15.0907 26.3536 5.2966 3.5610 11.1566 3.5907 8.2106 7.8333 11.7493 2.6567 0.6776 3.9207 0.7794 1.7983 8.8367 10.9372 1.5467 1.3809 10.6748 15.4168 1.5673 2.5654 6.3532 0.4354 0.5859 2.6295 56.8140 20.3978
temp: 298.150 k
press: 1.00000 atm
elementType: 6 6 6 6 6 6 6 6 7 1 1 1 1 1 6 8 6 6 1 1 1 6 1 1 1 6 1 1 1 6 1 1 1 27 6 6 6 6 6 6 1 1 1 6 1 1 1 6 1 1 1 6 1 1 1 6 1 1 1 8 6 8 6 1 1 1 6 8 6 6 6 6 1 6 1 6 1 1 1 6 6 6 6 6 1 6 1 6 1 1 1 8
symmnumber: 1
zpe: 2009842.7 jmol-1
zpe.correction: 0.765509 hartree
zpe.thermalcorrener: 0.812568 hartree
zpe.thermalcorrenthalpy: 0.813512 hartree
zpe.thermalcorrgfe: 0.687688 hartree
zpe.sumelectzpe: -3360.184140 hartree
zpe.sumelectthermal: -3360.137081 hartree
zpe.sumelectthermalent: -3360.136136 hartree
zpe.sumelectthermalfe: -3360.261960 hartree
dipole: -12.0885 9.6222 -8.0675
dipole: 17.4299
quadrupole: -183.0642 -246.6529 -237.4082
quadrupole: 3.1716 4.9270 -7.7833
quadrupole: 39.3109 -24.2778 -15.0331 3.1716 4.9270 -7.7833
hfenergy: -3360.9496486 hartree
pointgroup: C01 [X(C40H45Co1N1O5)]
dipole: 4.755705 -3.7785817 -3.1828016 debye
polarizability: 758.1105624|-11.8628226|689.2517176|72.5678047|56.4530461|592.9560026 unknown
InChI: InChI=1S/C28H27NO3.C10H15.C2H3O2.Co/c1-26(2,3)25(31)27(19-29(4)23-18-12-11-17-22(23)27)28(32,21-15-9-6-10-16-21)24(30)20-13-7-5-8-14-20;1-6-7(2)9(4)10(5)8(6)3;1-2(3)4;/h5-19H,1-4H3;1-5H3;1H3;/q-2;;-1;+3
charge 1 multiplicity 1
92 atoms
C  3.38035228 1.54135898 0.48558798
C  2.93753382 0.58027121 -0.41414675
C  3.87011481 -0.24801134 -1.04935863
C  5.2287658 -0.21771204 -0.78378017
C  5.65300745 0.71816192 0.1612911
C  4.74666199 1.58930031 0.77390036
C  1.56894855 0.22711963 -0.93817712
C  1.90863186 -0.79449408 -1.96593123
N  3.17606307 -1.07193854 -1.96675308
H  2.68748605 2.24293684 0.95160494
H  5.93306018 -0.88336093 -1.28550486
H  6.71495364 0.78142038 0.41062309
H  5.11375867 2.32789752 1.49056533
H  1.20439432 -1.35649758 -2.58081856
C  0.87139897 1.54089623 -1.36120381
O  0.43014797 2.20046701 -0.45268594
C  0.81991538 2.00232101 -2.81213028
C  -0.35997602 1.28630621 -3.49144459
H  -0.23511071 0.19351167 -3.50866528
H  -1.30871769 1.50659979 -2.9828701
H  -0.42668088 1.63175886 -4.53532476
C  0.58700464 3.51191027 -2.81579205
H  0.54318203 3.876163 -3.85309491
H  -0.35505986 3.77625847 -2.32101065
H  1.40386087 4.04033693 -2.2990958
C  2.11986767 1.68970247 -3.55719255
H  2.21875458 0.6260396 -3.8206202
H  2.11804134 2.23452541 -4.51360639
H  3.01322623 2.00780314 -2.99688668
C  3.81918828 -2.09514101 -2.76340037
H  4.28009775 -2.83463769 -2.0928719
H  3.06776935 -2.58286756 -3.3949252
H  4.59493426 -1.63566771 -3.3920453
Co -2.29632463 -0.3126623 0.01709196
C  -3.10452082 -2.03958437 0.79917415
C  -3.82191223 -0.87640588 1.2748539
C  -4.36419973 -0.19795638 0.15824502
C  -3.94017732 -0.89766826 -1.03045591
C  -3.23585518 -2.07037866 -0.62179481
C  -4.24186555 -0.49741705 -2.42897956
H  -3.51137933 -0.91822577 -3.13394238
H  -5.2429298 -0.85250201 -2.7281452
H  -4.22962324 0.59668487 -2.53801552
C  -5.22735738 1.00912043 0.18339724
H  -6.28378355 0.68985023 0.16738744
H  -5.06923957 1.61308963 1.08553805
H  -5.06487426 1.6448282 -0.69769182
C  -3.90315824 -0.43949831 2.69275432
H  -3.0672923 -0.8405508 3.28253687
H  -3.87799271 0.65688135 2.77125178
H  -4.84180585 -0.79589324 3.14955775
C  -2.44442282 -3.03545273 1.68709624
H  -1.65169516 -2.57452024 2.29683071
H  -3.18247878 -3.46694712 2.38297188
H  -1.99701366 -3.85986831 1.11861021
C  -2.69403146 -3.07735261 -1.56963526
H  -2.26256345 -3.9423411 -1.05060179
H  -3.50351203 -3.44329925 -2.22094062
H  -1.92307764 -2.63730113 -2.22150495
O  -2.30291446 1.46293126 -0.75016481
C  -2.48578553 2.49745469 -0.01041084
O  -2.59483305 2.48041886 1.21912103
C  -2.56257351 3.81797646 -0.73444423
H  -1.62145169 4.36315684 -0.56015573
H  -3.37443762 4.41820836 -0.29787882
H  -2.71900246 3.70220307 -1.81459025
C  0.51646481 -0.57745739 -0.00915318
O  -0.58949138 -0.72480802 -0.78703202
C  1.16548832 -1.93341347 0.3675708
C  2.42726071 -2.07565117 0.96460275
C  0.48266144 -3.0895755 -0.01509798
C  2.97441796 -3.34015042 1.17635709
H  3.01285594 -1.2080302 1.25986072
C  1.02310165 -4.35426601 0.20456044
H  -0.47358261 -2.97570687 -0.51584268
C  2.27408175 -4.48606272 0.80330324
H  3.961682 -3.42422261 1.63849742
H  0.4637041 -5.24191116 -0.10411555
H  2.70576173 -5.47614781 0.97283896
C  0.08588219 0.1559148 1.29003475
C  0.89626426 0.81049465 2.34544563
C  1.88095061 0.18523221 3.11733238
C  0.56286506 2.15209194 2.60447421
C  2.57686566 0.91261875 4.08010784
H  2.08264455 -0.87808826 3.00598746
C  1.27730767 2.87498284 3.55289145
H  -0.24832428 2.62518271 2.04650743
C  2.29708356 2.26211784 4.28238205
H  3.34102105 0.41292285 4.6809919
H  1.02947695 3.92492398 3.72913477
H  2.85776429 2.83276486 5.02762117
O  -1.13227365 0.1957801 1.4642753
