program: Gaussian 09
title: 000038445
version: EM64L-G09RevD.01
frameworkgroup: C1[X(C10H9NO3)]
method: RPBEPBE
basis: SDD
operation: Freq
keyword: #p
keyword: freq=noraman
keyword: PBEPBE/SDD
title: #p freq=noraman PBEPBE/SDD
converged: NO YES NO NO
title: Mulliken charges:
elementType: O O O N C C C C C C C C C C H H H H H H H H H
charge: -0.204664 -0.206533 -0.194267 0.024827 -0.549728 -0.416186 0.407079 -0.503575 0.130977 0.072691 -0.380011 -0.485987 0.388919 -0.371999 0.239503 0.234711 0.224819 0.222502 0.234469 0.260408 0.250274 0.330925 0.290844
chargesum: 0.00000
title: Mulliken charges with hydrogens summed into heavy atoms:
elementType: O O O N C C C C C C C C C C
charge: -0.204664 -0.206533 -0.194267 0.024827 -0.075514 0.031135 0.407079 -0.008698 0.130977 0.072691 -0.129737 -0.155061 0.388919 -0.081155
polarizability: 1.78960248e+02 1.10404835e+00 1.39525239e+02 -2.29892290e+00 1.29094529e+00 6.07830390e+01
1716.lowfreq: -11.7379 -7.9645 -0.0004 0.0006 0.0007 7.0073 49.9480 58.5835 104.4732
frequency: 49.9308 58.5633 104.4717 146.6795 155.9445 221.8906 291.8414 309.7350 323.7919 402.2061 426.6490 447.8038 492.8718 500.6056 534.4523 546.0452 612.2463 633.9705 699.9805 705.7763 736.8361 760.1283 832.0097 859.2696 871.0206 897.5890 909.4070 977.5947 997.0806 1030.8624 1057.9285 1072.4780 1092.9553 1132.3708 1134.6847 1183.5957 1202.1994 1216.9553 1225.1762 1256.5900 1263.2309 1319.0537 1330.9244 1356.1998 1372.7843 1397.6459 1421.9979 1435.9438 1449.8884 1469.1883 1477.4599 1576.2574 1594.6231 1620.3523 2958.6282 2966.0220 3000.5503 3039.1744 3062.7879 3072.4755 3140.2457 3175.3701 3184.2590
redmass: 13.8945 4.2279 3.1913 5.2476 9.8281 2.6792 6.6181 4.2698 3.9015 2.9746 3.7062 4.7928 5.4911 4.4788 4.7461 3.1166 4.9626 3.8217 5.6269 4.5428 6.3756 3.4839 1.7298 2.8725 1.7250 2.5441 2.1711 1.4259 1.3559 2.5607 2.0772 1.6680 3.5993 1.3870 1.2652 1.6430 2.6843 6.5683 1.7124 1.3451 1.7817 1.4262 1.6379 1.5130 9.2306 7.9167 3.2733 1.2120 1.2135 1.9504 1.1691 8.1392 9.0247 8.4292 1.0665 1.0674 1.0619 1.0927 1.1015 1.0944 1.0906 1.0920 1.0949
irintensity: 0.8423 0.7592 2.1027 1.0179 1.1623 1.0123 4.5939 2.7252 2.6080 1.7671 3.0618 0.7905 10.4030 5.5545 4.1723 9.4068 7.3834 6.2115 5.4701 13.3720 15.4158 2.6776 12.2272 13.0889 8.7626 12.9863 20.0868 19.5687 0.1361 3.5809 3.2753 39.0449 22.8060 23.2331 2.9127 48.9531 50.8967 260.1391 31.9356 3.8709 29.2363 4.8509 1.1670 7.7421 123.3968 4.9110 16.9520 11.9567 26.1932 0.9392 15.4300 52.4228 91.7250 90.2130 13.4875 8.4329 33.9570 29.3488 38.1508 15.3393 9.8893 10.8350 2.5481
temp: 298.150 k
press: 1.00000 atm
elementType: 8 8 8 7 6 6 6 6 6 6 6 6 6 6 1 1 1 1 1 1 1 1 1
symmnumber: 1
zpe: 453368.2 jmol-1
zpe.correction: 0.172679 hartree
zpe.thermalcorrener: 0.184052 hartree
zpe.thermalcorrenthalpy: 0.184996 hartree
zpe.thermalcorrgfe: 0.134516 hartree
zpe.sumelectzpe: -665.813460 hartree
zpe.sumelectthermal: -665.802087 hartree
zpe.sumelectthermalent: -665.801143 hartree
zpe.sumelectthermalfe: -665.851622 hartree
dipole: 5.8317 -5.2044 -0.3111
dipole: 7.8224
quadrupole: -89.9692 -85.6160 -79.4678
quadrupole: -1.8774 -0.2594 0.1097
quadrupole: -4.9515 -0.5983 5.5499 -1.8774 -0.2594 0.1097
hfenergy: -665.9861387 hartree
pointgroup: C01 [X(C10H9N1O3)]
dipole: 2.2696323 2.074838 0.1238401 debye
dipolederiv: -0.5824549 0.0021724 0.0004075 0.2141574 -0.9710083 -0.0157037 -0.0122026 -0.026992 -0.3128746 -0.8852171 0.1724381 -0.005694 0.1314133 -0.5376646 -0.0049769 -0.0102758 -0.0040717 -0.2292977 -0.6179206 -0.158769 -0.0096917 -0.199922 -0.7402395 -0.0157749 -0.0130448 -0.0151075 -0.2188915 1.7778215 0.1374925 0.0285273 0.2578691 1.0943648 0.0262469 0.0402648 0.0220313 0.1895253 -0.1152845 -0.0413543 0.0030651 -0.0449455 0.0474395 -0.0224543 -0.1125354 -0.0879998 0.1204579 0.0990833 0.0148484 0.0160257 -0.0156907 0.0362332 0.0091064 -0.0254486 0.0125797 0.1378419 0.4935749 0.1874828 0.0405457 -0.0073155 0.1540402 -0.0044823 0.1194111 0.0301092 -0.0087322 -0.3344969 -0.1026436 -0.0356981 -0.094287 -0.0495876 -0.0056889 -0.0688079 -0.0229278 0.1044202 -0.681161 0.1854586 -0.0107481 0.0255221 -0.371061 -0.009591 -0.046234 -0.0174819 -0.0169699 1.2940794 -0.2460581 0.0427846 -0.3941629 1.0874935 0.0511347 0.0738493 0.0528354 0.1184513 -0.5520668 -0.0035155 -0.003035 0.1033661 0.1827846 0.0208223 -0.0179218 0.0211633 -0.1494937 0.2788876 0.0024995 0.0091337 -0.0441717 -0.068344 0.0027645 0.0071901 -0.0000071 -0.0498325 -0.5947804 -0.1132204 -0.0140315 -0.1457221 -0.1579855 -0.0092543 -0.0133768 -0.0071213 0.0389107 0.144071 0.0075952 0.0106953 0.2698758 0.0752535 0.0039847 0.0017391 0.001003 -0.0821191 0.0217884 0.0338198 -0.0033364 0.0010443 -0.1139129 0.0702318 0.0519778 0.0977243 0.0624183 -0.0325039 -0.0427124 -0.0406391 0.0053872 0.0914559 -0.0107455 -0.022146 -0.0413212 -0.1024501 0.1019691 0.0142899 -0.0618859 0.0345116 0.034181 -0.0187518 0.008876 0.0057937 -0.1468658 -0.1968767 -0.081864 0.0045069 -0.0916642 0.0314899 0.0011884 -0.0271425 -0.0076906 0.0886046 0.0766816 -0.0210705 -0.0109692 -0.0588423 0.0791523 -0.0210633 -0.0250949 0.0283438 -0.0978386 -0.0018972 0.0583015 0.039661 0.0897845 -0.0356722 -0.0396532 0.0862051 -0.0411515 0.0799695 0.065292 -0.0591626 -0.0012596 -0.0323415 -0.079398 -0.0058237 0.0054981 -0.0000137 0.1436561 0.1624915 -0.0108681 0.0005818 -0.0341192 0.1094063 -0.0017288 -0.0016732 0.0003149 0.1639552 0.0789198 0.0648398 0.001054 0.0302534 0.101579 0.0002132 0.000893 -0.0000125 0.1671546 unknown
polarizability: 179.0061254|-0.6199801|139.478595|1.5117706|1.9364072|60.783805 unknown
InChI: InChI=1S/C10H9NO3/c12-10-3-1-2-7-4-5-8(11(13)14)6-9(7)10/h4-6H,1-3H2
charge 0 multiplicity 1
23 atoms
O  1.590787 -2.541387 -0.01036
O  -4.029618 0.530019 -0.021766
O  -3.272156 -1.620614 -0.063009
N  -3.080372 -0.346481 -0.028065
C  2.399132 1.627673 0.132087
C  3.399844 0.638029 -0.503744
C  0.9714 1.109162 0.080709
C  3.252018 -0.759924 0.135572
C  0.708963 -0.294782 0.037112
C  1.82783 -1.300991 0.039892
C  -0.125017 2.009389 0.081695
C  -0.623626 -0.773927 -0.001569
C  -1.679459 0.149943 0.006929
C  -1.451693 1.545715 0.048141
H  2.457201 2.61681 -0.358114
H  2.681542 1.791731 1.19409
H  3.217294 0.570952 -1.593349
H  4.432862 1.006023 -0.368381
H  3.51073 -0.700738 1.214906
H  3.933606 -1.502977 -0.312591
H  0.067986 3.087639 0.105993
H  -0.811279 -1.851032 -0.034678
H  -2.305972 2.227668 0.047903
