program: Gaussian 16
title: Title Card Required
version: ES64L-G16RevC.01
method: RPBE1PBE
basis: def2SVP
operation: Freq
keyword: #P
keyword: Geom=AllCheck
keyword: Guess=TCheck
keyword: SCRF=Check
keyword: GenChk
keyword: RPBE1PBE/def2SVPFreq
converged: YES YES YES YES
title: Mulliken charges:
elementType: C C C C C C C C N H H H H H C O C C H H H C H H H C H H H C H H H C O C C C C H C H C H H H C C C C C H C H C H H H O O H H O C O C H H H H
charge: -0.130698 -0.017290 0.115220 -0.087629 -0.055392 -0.036427 -0.079469 0.086693 -0.292959 0.032930 0.029623 0.041913 0.037418 0.066337 0.376771 -0.456412 -0.357545 -0.037830 0.043429 0.050169 0.042695 0.014511 0.037790 0.040458 0.042581 0.003864 0.034742 0.042099 0.035091 0.058732 0.080069 0.081855 0.074582 0.181214 -0.483814 -0.106101 -0.022687 -0.039804 -0.035189 0.041346 -0.041303 0.043358 -0.033107 0.047836 0.044499 0.048537 0.196453 -0.001804 -0.042358 -0.015049 -0.042438 0.033480 -0.044548 0.033782 -0.028647 0.046627 0.041645 0.047977 -0.308813 -0.339446 0.234935 0.302890 -0.287207 0.204085 -0.239050 -0.042319 0.111348 0.092296 0.107140 0.376313
chargesum: -0.00000
title: Mulliken charges with hydrogens summed into heavy atoms:
elementType: C C C C C C C C N C O C C C C C C O C C C C C C C C C C C C C O O O C O C
charge: -0.097769 -0.017290 0.115220 -0.058006 -0.013479 0.000991 -0.079469 0.153030 -0.292959 0.376771 -0.456412 -0.357545 0.098464 0.135339 0.115796 0.295237 0.181214 -0.483814 -0.106101 0.018659 0.003554 0.012646 0.003196 0.015430 0.196453 -0.001804 -0.008878 0.018734 0.004190 -0.002903 0.019330 -0.308813 -0.104511 0.089106 0.204085 0.063840 0.268464
chargesum: 0.00000
polarizability: 5.14622691e+02 8.09462062e+00 5.17163037e+02 2.31487651e+01 7.96796999e+01 4.28200846e+02
1716.lowfreq: -327.4643 -8.9337 0.0003 0.0009 0.0010 4.9453 15.8379 29.0135 39.3770
frequency: -327.4058 28.7387 39.1882 46.3440 54.9612 55.7347 62.0526 69.6646 75.4303 78.2841 91.4748 99.2540 102.0711 120.3403 125.9363 146.2151 159.9772 166.4265 172.4592 178.0188 192.8186 196.7459 206.5545 216.4095 220.6681 231.2648 239.8331 248.9633 259.1407 265.2954 270.9154 294.9657 296.2383 305.2122 316.2791 321.9418 336.9588 358.4696 374.3073 379.0827 396.0210 414.5467 422.0316 428.8066 436.9270 451.2323 473.7310 496.0521 507.5292 517.0921 526.5782 541.8001 548.8858 552.0832 571.8305 592.0917 598.4432 609.6024 619.8533 629.5076 629.8249 657.7970 668.6847 676.7595 681.8404 708.6298 711.6235 715.4422 736.0837 748.0551 767.5165 782.6609 798.0821 802.1180 807.2367 818.2296 846.9400 862.3269 867.5909 878.8696 880.4471 889.5923 927.2456 949.3180 952.1714 952.4620 955.2759 961.2770 962.4450 967.7639 973.7200 994.5188 1009.5248 1011.5853 1017.8233 1019.2585 1019.4008 1026.2899 1034.1423 1035.6482 1038.3083 1039.8138 1051.6341 1052.0730 1058.5834 1060.9966 1067.3668 1087.9909 1105.3255 1112.6151 1124.8075 1142.4695 1147.4230 1156.2687 1156.8771 1158.5356 1161.4403 1179.7900 1183.0083 1194.8112 1227.0679 1233.8131 1247.2190 1258.9430 1264.8622 1273.1274 1277.3515 1306.9884 1326.2808 1334.3497 1335.4919 1352.0602 1369.0952 1373.4297 1375.5235 1387.5971 1395.0243 1399.3610 1404.0230 1408.5316 1412.1155 1417.9396 1421.9975 1436.1769 1442.7634 1446.0992 1452.1709 1452.5327 1457.4145 1458.2190 1468.5724 1477.3603 1482.4952 1484.1936 1490.6754 1508.3964 1517.0257 1526.0496 1532.4542 1534.6965 1539.1093 1554.8278 1607.9154 1645.8339 1663.7074 1667.5926 1686.2119 1687.5410 1694.1786 1698.3357 1728.6197 1753.5889 2028.8435 3050.4709 3052.1854 3057.2970 3061.0579 3079.3478 3138.2530 3143.6354 3149.0309 3155.2801 3155.3128 3157.5610 3166.3355 3173.9705 3197.7578 3202.9555 3203.0250 3203.5035 3209.0401 3211.3171 3215.8555 3217.3400 3219.5945 3223.4699 3226.2599 3226.9651 3228.4863 3249.2541 3253.6025 3258.3902 3267.6416 3715.7609
redmass: 3.3176 4.6792 3.7947 4.4733 4.6820 4.8930 1.9766 1.6957 2.9331 3.6486 3.9653 3.9602 4.1611 5.0157 6.8722 3.4686 6.7004 6.0699 5.9069 4.8524 2.7135 4.7743 1.5933 3.9920 3.5959 1.5728 2.4492 3.4230 4.1162 2.2141 3.6482 3.7556 3.8610 1.2151 1.6509 2.6118 2.8909 4.5185 3.2269 2.7136 5.7309 2.8303 3.8865 3.1312 2.8146 2.9788 3.6433 5.0782 1.2861 4.1376 4.0836 3.7967 5.3612 5.6024 4.3849 4.4843 3.6589 4.7721 2.4107 6.1996 6.3312 3.9275 4.7624 5.1151 4.0123 5.5793 4.7328 1.5442 1.5187 4.6394 1.3553 2.7248 3.9109 3.2694 2.8104 5.2489 2.7980 3.1143 1.3078 1.6104 1.2643 1.6122 3.7121 1.8278 1.3947 1.7769 1.5575 1.7692 1.8277 1.5218 2.1831 2.7618 1.3149 1.3999 3.8101 1.9069 2.5398 1.6851 1.3483 1.7355 1.3437 1.5531 1.9651 1.9045 3.1516 2.5323 2.0014 1.8016 1.7141 1.5987 2.0608 1.3145 1.3455 1.2658 1.3441 1.0625 1.0612 2.2217 1.1054 1.1204 1.7185 2.9509 2.5361 1.8278 1.6702 2.6673 1.8338 2.9032 1.3766 1.6161 1.5319 1.3143 1.3737 2.3162 1.4848 1.2843 1.2639 5.5317 7.9818 1.2035 2.7746 3.3877 1.1357 1.0492 1.2480 1.0469 1.6352 1.2825 1.0767 1.3394 1.0894 1.1524 2.5728 2.5421 1.4171 2.1430 1.8811 3.3288 2.5848 2.5646 3.9629 2.1232 5.8315 7.0928 6.6192 6.5228 6.1839 6.5906 1.9159 6.9487 1.8333 11.8302 1.1771 1.0374 1.0369 1.0384 1.0386 1.0387 1.1029 1.1031 1.1039 1.1038 1.1049 1.1037 1.1036 1.1010 1.1051 1.0869 1.0874 1.0880 1.0906 1.0909 1.0933 1.0953 1.0955 1.1087 1.1005 1.1004 1.0983 1.0936 1.0939 1.0933 1.0993 1.0663
irintensity: 509.3346 0.8906 0.0280 2.8693 0.8072 0.8677 2.4419 2.1844 0.6857 0.5180 0.9291 2.0682 3.1265 2.7760 1.3599 4.7250 5.5426 0.2799 7.9145 1.7207 1.8022 5.7338 3.4580 14.0674 4.8167 3.3913 11.1576 9.7022 5.1916 19.8426 2.2265 25.2579 58.4358 20.6152 30.7765 37.2325 16.7707 17.7365 9.2035 61.6444 10.5130 0.4812 6.4103 2.8400 1.6636 28.0595 24.3007 228.2279 188.3745 59.5297 30.7898 10.5640 17.6030 3.7633 60.9012 22.3872 9.4289 16.5372 2.8760 3.7334 0.2527 231.2576 39.4548 119.1045 146.3298 43.8367 40.8046 73.7882 85.7811 26.8119 126.5343 36.6036 6.0290 7.7882 11.3834 240.5767 85.8261 98.9006 2.1567 5.6950 1.4509 34.1554 516.8963 134.6663 78.9972 223.9581 51.8004 14.0487 71.6746 5.7040 156.2450 273.7181 2.3438 1.8767 9.5806 4.0462 7.0534 3.6133 1.3822 4.9337 0.7446 68.0428 50.3436 37.5387 134.7259 47.1324 14.8133 52.3922 10.7332 16.6677 76.2703 10.4549 3.0175 3.2982 164.3256 1.3700 3.4858 73.5327 20.5575 14.4859 36.8301 219.8721 219.6975 46.8243 428.9711 129.8743 24.8584 567.8443 173.9222 423.4410 614.6749 25.7758 46.9780 48.9570 15.4562 125.6249 36.0969 26.1989 5.6898 207.6225 29.8461 43.5896 22.9778 2.3900 22.2614 7.3857 11.7964 3.9961 4.6294 28.0047 31.7822 33.3151 17.9159 8.3898 63.8111 177.4129 617.3345 33.2345 17.5826 33.1207 57.3055 392.2634 101.5381 5.6401 19.9409 1.7118 0.7821 17.5857 347.0038 23.1406 1399.2424 371.7593 4485.2739 32.7129 33.1132 29.8755 68.1342 3.8072 24.9447 25.1727 41.2383 25.6439 12.0734 26.3898 25.4447 3.2129 3.4062 0.0286 0.2979 4.1621 2.2558 5.5062 12.2860 7.9276 8.3256 1.9366 12.2270 12.1886 7.8599 1.6488 2.7173 6.5804 5.0223 455.9699
temp: 298.150 k
press: 1.00000 atm
elementType: 6 6 6 6 6 6 6 6 7 1 1 1 1 1 6 8 6 6 1 1 1 6 1 1 1 6 1 1 1 6 1 1 1 6 8 6 6 6 6 1 6 1 6 1 1 1 6 6 6 6 6 1 6 1 6 1 1 1 8 8 1 1 8 6 8 6 1 1 1 1
symmnumber: 1
zpe: 1505628.3 jmol-1
zpe.correction: 0.573464 hartree
zpe.thermalcorrener: 0.607368 hartree
zpe.thermalcorrenthalpy: 0.608312 hartree
zpe.thermalcorrgfe: 0.510296 hartree
zpe.sumelectzpe: -1665.594797 hartree
zpe.sumelectthermal: -1665.560893 hartree
zpe.sumelectthermalent: -1665.559948 hartree
zpe.sumelectthermalfe: -1665.657964 hartree
dipole: 8.5761 -6.9124 -8.6423
dipole: 14.0007
quadrupole: -177.3026 -204.2702 -214.5930
quadrupole: -8.3363 -6.0908 6.7397
quadrupole: 21.4193 -5.5483 -15.8710 -8.3363 -6.0908 6.7397
hfenergy: -1666.1682605 hartree
pointgroup: C01 [X(C30H33N1O6)]
dipole: 3.3740919 -2.719529 -3.400153 debye
polarizability: 514.6226909|8.0946206|517.1630366|23.1487651|79.6796999|428.2008465 unknown
InChI: InChI=1S/C30H33NO6/c1-21(32)36-38-37(30(34,35)28(2,3)4)29(23-16-10-7-11-17-23,27(33)22-14-8-6-9-15-22)25-20-31(5)26-19-13-12-18-24(25)26/h6-20,32,34H,1-5H3
charge 0 multiplicity 1
70 atoms
C  1.49209558 1.90716643 2.08621042
C  1.8505505 0.67176602 1.50785332
C  3.23251338 0.33076729 1.46760198
C  4.23801018 1.17747266 1.94465885
C  3.85031963 2.39330659 2.4896224
C  2.49021828 2.74871448 2.56119514
C  1.14501712 -0.42137025 0.87615931
C  2.11153563 -1.34410242 0.53392518
N  3.35579015 -0.91569395 0.90049934
H  0.44610895 2.20929559 2.14209058
H  5.29107196 0.89241444 1.88719784
H  4.61010701 3.08151178 2.86995988
H  2.21156446 3.70939637 3.0032451
H  1.99560118 -2.308521 0.040521
C  -0.51964492 1.61233913 -0.86292748
O  -1.01277204 2.00886478 0.22813137
C  -1.21778512 2.03365493 -2.18400804
C  -0.51377644 1.50924306 -3.43441142
H  0.55378694 1.78020668 -3.45091524
H  -0.59615318 0.41626936 -3.53485847
H  -0.97774096 1.94978825 -4.33163799
C  -2.66667236 1.55970794 -2.16747756
H  -3.20351582 1.95688723 -3.04394907
H  -2.73422403 0.46311528 -2.20201205
H  -3.18799208 1.90774001 -1.26299232
C  -1.18774735 3.56497921 -2.18352663
H  -0.1562769 3.94665138 -2.23455493
H  -1.74284975 3.96040148 -3.04880135
H  -1.64980966 3.95824728 -1.26492045
C  4.6005525 -1.51151054 0.48551144
H  5.30873834 -1.56463162 1.32576862
H  4.41538357 -2.53559002 0.13693926
H  5.06539569 -0.93183303 -0.32949991
C  -0.2916297 -0.55480818 0.41198475
O  -0.46469729 0.04749757 -0.87930206
C  -0.63915367 -2.0447026 0.30408928
C  -0.64848743 -2.80469871 1.48064713
C  -0.9317536 -2.6710925 -0.91000827
C  -0.94643219 -4.16340227 1.4435069
H  -0.42038392 -2.32407428 2.43634217
C  -1.22370697 -4.03559818 -0.94482708
H  -0.94746128 -2.10244401 -1.84018451
C  -1.23324742 -4.78609371 0.22810815
H  -0.95333124 -4.74036647 2.37220805
H  -1.44816146 -4.5116744 -1.90328668
H  -1.46475073 -5.85421351 0.19728718
C  -1.28081012 0.02752458 1.45071449
C  -2.74685641 0.14700332 1.18012209
C  -3.43690164 1.07520147 1.97306218
C  -3.45916998 -0.61465149 0.25021861
C  -4.80523691 1.25821436 1.82066992
H  -2.87197747 1.66278747 2.70140116
C  -4.83700754 -0.44452615 0.11268811
H  -2.9532727 -1.35560233 -0.36652932
C  -5.51209938 0.49451493 0.88789159
H  -5.32791424 1.99832016 2.43290815
H  -5.38398185 -1.05290082 -0.61270651
H  -6.59057309 0.63191036 0.76989153
O  -0.87676072 0.20611161 2.58630379
O  0.89290253 1.98739822 -1.00685931
H  1.16970167 2.33132832 -0.13932218
H  1.88672105 1.17127911 -1.49448922
O  1.15227009 -0.95183864 -2.39280732
C  2.3308792 -0.50021254 -2.45684684
O  2.68714573 0.59319945 -1.91731586
C  3.34684986 -1.29447404 -3.17907429
H  3.55696553 -2.20442743 -2.59437047
H  4.26811441 -0.71743308 -3.31845862
H  2.9316949 -1.61697766 -4.14491347
H  0.4269465 -0.43765475 -1.72189031
