program: Gaussian 16
title: TSb2-1-amine-unlock-g16
version: ES64L-G16RevA.03
method: RM062X
basis: 6-31G(d)
operation: Freq
keyword: #N
keyword: Geom=AllCheck
keyword: Guess=TCheck
keyword: SCRF=Check
keyword: GenChk
keyword: RM062X/6-31G(d)
keyword: Freq
converged: YES YES YES YES
title: Mulliken charges:
elementType: C C C C O C C O Si C C C C C C C H H H H H H H H O H H H H H H C H H H C H H H C H H H N C C C H C H H H H H H H C O O C O O C C H H H H H C C H H H H H
charge: 0.234384 -0.268278 0.087432 0.023023 -0.467397 -0.237736 0.295690 -0.672462 0.944216 -0.334162 -0.311266 -0.140442 0.370919 -0.147281 -0.755464 -0.752282 0.197199 0.204645 0.219071 0.215856 0.220745 0.204886 0.184306 0.203866 -0.681780 0.200032 0.185187 0.180571 0.181282 0.207693 0.183648 -0.491021 0.148155 0.165116 0.157617 -0.490702 0.147637 0.157971 0.165111 -0.497518 0.151812 0.164585 0.159727 -0.420760 -0.168590 -0.149677 -0.348041 0.212519 -0.352374 0.189935 0.177081 0.182623 0.186151 0.196700 0.182886 0.189141 0.672376 -0.510781 -0.500412 0.668406 -0.506243 -0.502385 -0.070772 -0.517287 0.190111 0.188535 0.186174 0.185660 0.182842 -0.069398 -0.517119 0.187287 0.188302 0.186161 0.182802 0.183557
chargesum: -0.00000
title: Mulliken charges with hydrogens summed into heavy atoms:
elementType: C C C C O C C O Si C C C C C C C O C C C N C C C C C O O C O O C C C C
charge: 0.234384 -0.071079 0.292077 0.242095 -0.467397 -0.032850 0.295690 -0.672462 0.944216 0.102440 0.076905 -0.140442 0.370919 -0.147281 -0.182842 -0.186492 -0.681780 -0.020133 -0.019982 -0.021394 -0.420760 0.233071 0.223144 0.015191 0.026949 0.672376 -0.510781 -0.500412 0.668406 -0.506243 -0.502385 0.307874 0.037389 0.306192 0.035401
chargesum: -0.00001
1716.lowfreq: -385.5300 -0.0017 -0.0013 -0.0008 3.7854 6.6952 8.9145 17.7794 21.2513
frequency: -385.5299 17.7102 21.1962 26.9409 28.6292 30.4617 39.4149 51.4041 58.9941 66.7539 73.3094 78.4038 83.3499 86.2937 92.8633 97.0305 108.0718 118.6077 122.5358 135.1024 143.3919 147.9830 159.0155 169.4989 179.1474 185.3775 191.1641 198.0178 207.1117 215.6075 223.2537 234.8722 244.5148 252.8645 254.9061 263.6265 272.8029 281.3688 283.4178 287.1058 296.8325 298.5537 302.1825 313.2254 321.0903 340.0461 352.8615 377.1027 381.1874 385.7537 392.8769 397.6219 407.8469 442.8229 453.1435 475.2093 488.9798 494.5027 515.5402 542.4056 573.0177 578.1375 583.8510 605.7741 646.2673 673.4044 685.4569 707.5441 720.1945 744.0431 746.5157 760.1157 766.9238 772.8279 790.8611 801.2614 805.6838 822.0681 822.6508 831.5115 844.3863 852.8287 860.5377 863.1273 879.9514 889.6351 891.3573 897.0533 903.7741 908.6269 917.7421 921.3958 935.3814 942.0200 942.8316 966.5173 970.8539 971.4386 975.6810 994.0987 1020.7812 1036.7775 1039.9339 1056.8743 1060.9481 1069.2087 1082.4114 1099.7260 1132.8547 1137.4466 1147.4220 1156.6200 1157.0763 1175.5568 1189.2541 1191.6670 1192.4147 1208.2612 1214.0967 1224.4183 1238.1155 1239.4558 1252.7028 1256.2529 1265.6646 1275.6256 1280.2331 1282.0076 1296.5398 1300.7964 1306.3390 1311.5252 1315.6502 1315.9562 1320.9003 1331.7351 1336.7569 1347.5360 1360.5896 1368.2535 1372.7627 1395.3591 1401.8775 1411.9512 1413.2384 1415.1012 1415.6464 1416.8446 1433.3726 1439.0309 1453.0045 1453.8483 1467.3978 1470.7578 1481.2766 1482.4882 1485.4072 1489.6203 1497.0194 1499.2592 1502.8982 1503.7524 1504.1171 1505.4931 1505.6064 1507.0278 1510.4758 1511.9796 1519.8325 1520.7763 1522.5051 1524.2318 1525.3256 1537.0419 1537.5756 1539.3731 1586.4109 1671.5840 1680.3158 1857.1592 1880.3188 3043.9675 3045.6143 3048.9902 3070.9795 3072.7881 3074.1156 3088.4160 3096.7284 3096.8581 3099.0356 3100.9870 3108.7115 3110.3035 3110.7498 3110.9712 3112.1683 3112.9272 3124.5008 3128.3942 3133.9690 3135.7594 3138.2481 3141.6039 3144.6450 3147.0936 3154.9627 3156.6748 3158.0405 3163.9528 3174.9723 3175.8531 3179.5384 3179.6031 3180.2834 3181.4981 3182.3244 3185.1223 3192.6779 3215.3554 3246.3433 3296.9653
redmass: 9.3213 4.2776 3.9504 3.5650 3.9861 3.1672 3.7331 3.5229 3.0658 3.5549 2.7815 2.7671 4.0484 4.5590 4.1409 3.8147 3.5328 2.6586 1.8143 2.9966 2.2748 1.2557 3.1563 3.2826 2.9894 3.1854 2.6992 3.7618 3.6088 2.8152 3.0318 2.5186 1.3908 2.3888 2.2032 2.5804 1.5617 1.9951 1.7813 1.5669 2.2069 1.5693 1.4291 3.0017 3.6087 4.0895 2.4463 3.9432 3.4388 3.2888 2.5803 2.9349 3.2440 2.5300 5.3929 5.7150 4.7229 4.5468 4.8639 6.2467 3.5222 1.9168 4.1070 5.0284 4.3897 3.4417 3.8280 1.6106 5.1885 4.9551 4.0874 1.5264 1.2872 3.6322 3.1154 2.6127 2.8151 1.1224 1.2306 1.8972 1.8504 2.2501 1.8537 1.7408 5.5675 2.3835 2.4267 2.9566 2.6385 2.0873 1.3962 2.3340 1.8718 1.4399 2.3184 1.2047 1.6144 1.6018 1.2360 1.6745 3.4221 1.4202 1.4004 1.9691 2.2062 2.9740 2.9382 1.9502 2.9139 3.2271 1.6570 2.2488 2.2440 7.4987 1.6843 1.5585 1.5565 1.5141 1.4302 2.1226 2.7169 2.7336 2.4055 1.6442 1.2624 2.0546 1.2828 1.6885 1.2895 1.5984 1.3380 2.0790 1.0962 1.0941 2.5885 1.3563 2.3158 3.0347 2.0219 1.4184 2.1611 2.0977 1.7411 1.2530 1.6734 1.3391 1.2737 1.3699 2.9617 1.2314 1.5031 1.5280 1.0542 1.1013 1.8239 1.1250 1.0576 1.0552 1.4860 1.1031 1.0513 1.0385 1.0480 1.0388 1.0498 1.1134 1.0582 1.0579 1.3722 1.2173 1.0522 1.6686 1.0675 1.1259 1.0928 1.0923 5.7020 5.2305 6.9135 12.5463 12.3415 1.0393 1.0382 1.0400 1.0627 1.0383 1.0376 1.0596 1.0361 1.0360 1.0640 1.0677 1.0982 1.0983 1.0642 1.0578 1.0580 1.0973 1.0604 1.1009 1.1015 1.1024 1.1060 1.1005 1.0998 1.1006 1.1005 1.1084 1.1085 1.1025 1.1057 1.0913 1.1030 1.1032 1.1032 1.1062 1.1062 1.1000 1.0994 1.0902 1.0917 1.0971
irintensity: 891.6081 0.3930 0.3495 0.3858 0.7471 0.5327 0.5189 0.8037 1.0878 1.0221 0.1047 5.4098 0.1046 0.6012 0.9259 4.7706 4.8922 2.7232 0.0175 2.6483 0.4807 0.2212 0.8808 0.3915 11.9548 4.4604 2.5169 17.6863 1.9236 12.6935 4.6218 19.7705 3.4379 5.2767 3.2313 1.8974 1.2146 6.9296 11.5873 1.5653 5.4498 3.4388 2.0179 15.9963 6.6481 13.7519 22.1942 14.8446 9.3064 8.8323 7.0542 1.6634 20.6662 4.1226 76.2370 0.5166 64.9751 12.6379 16.3765 2.3574 4.4877 4.6021 19.6310 74.9602 2.7495 3.1462 29.7927 1.2670 29.4956 7.2465 148.5241 69.5777 3.7878 10.3135 55.0492 154.8713 14.0643 2.0273 0.6891 1.7034 360.9578 126.5719 13.0247 184.4583 11.8890 17.7815 48.6002 93.5736 57.8722 68.5770 8.9038 37.1044 26.5690 4.7043 2.7264 0.0920 4.3669 5.3473 93.6679 5.4555 207.8778 8.8044 4.8764 30.8581 29.5893 10.1763 26.1228 22.8120 68.9553 186.2718 2.9491 19.2956 13.8453 130.4386 32.1256 8.9664 6.8004 0.6091 18.8736 38.5550 0.2050 1.4555 1.0422 49.4873 14.2163 238.8175 7.2697 32.1609 75.5089 72.9027 129.0741 76.0888 6.5963 4.9699 498.8127 14.6864 234.1027 614.0627 113.3384 55.5237 315.3154 72.7930 26.4507 1.9403 33.5972 38.0287 1.2332 61.1720 267.3624 3.7166 18.3206 0.3338 8.0616 56.6271 115.6385 22.7810 6.0548 21.4281 67.9592 11.6829 0.6022 9.9609 0.8273 10.0440 0.6491 23.9204 1.4567 1.6323 2.7380 20.8041 11.4595 11.5729 17.2669 53.5819 7.8804 6.4930 772.1412 403.6692 468.6823 686.0035 25.3087 49.3951 44.1164 94.9738 97.4342 8.9257 8.2920 59.0086 14.3374 13.5540 22.7150 60.6278 44.1591 53.3354 16.2469 24.5408 20.3071 71.4240 1.4691 17.8659 50.8453 46.2816 2.9928 51.5179 12.3793 17.1559 6.6700 8.6145 7.7018 22.3022 38.3135 6.5089 22.2920 22.8825 3.2931 44.6396 44.7264 3.6014 3.1537 1.7132 2.9846 0.1805
temp: 298.150 k
press: 1.00000 atm
elementType: 6 6 6 6 8 6 6 8 14 6 6 6 6 6 6 6 1 1 1 1 1 1 1 1 8 1 1 1 1 1 1 6 1 1 1 6 1 1 1 6 1 1 1 7 6 6 6 1 6 1 1 1 1 1 1 1 6 8 8 6 8 8 6 6 1 1 1 1 1 6 6 1 1 1 1 1
symmnumber: 1
zpe: 1707952.7 jmol-1
zpe.correction: 0.650525 hartree
zpe.thermalcorrener: 0.689587 hartree
zpe.thermalcorrenthalpy: 0.690531 hartree
zpe.thermalcorrgfe: 0.577444 hartree
zpe.sumelectzpe: -1884.967457 hartree
zpe.sumelectthermal: -1884.928395 hartree
zpe.sumelectthermalent: -1884.927451 hartree
zpe.sumelectthermalfe: -1885.040538 hartree
dipole: -2.4826 -5.6556 -0.0475
dipole: 6.1767
quadrupole: -190.6496 -193.6877 -220.5526
quadrupole: -10.9683 5.4741 7.5728
quadrupole: 10.9803 7.9423 -18.9226 -10.9683 5.4741 7.5728
hfenergy: -1885.6179814 hartree
pointgroup: C01 [X(C26H41N1O7Si1)]
dipole: -0.9815303 -2.2230021 0.015177 debye
polarizability: 481.0764751|-1.4477222|417.6867964|-3.1669453|-6.4366374|412.1290142 unknown
InChI: InChI=1S/C26H41NO7Si/c1-8-31-23(29)26(24(30)32-9-2,14-12-17-27-15-10-11-16-27)19-21-22(28)20(13-18-33-21)34-35(6,7)25(3,4)5/h12-13,17-18H,8-11,14-16,19H2,1-7H3
charge 0 multiplicity 1
76 atoms
C  -0.59861296 -0.01674392 -0.63681024
C  -1.102291 -1.31116974 0.87137317
C  -0.25306859 -2.39499813 0.66898373
C  0.18934699 -1.52115918 -2.24051495
O  -0.80768263 -0.74131813 -1.76352377
C  1.47857067 -1.3014959 -1.87249243
C  1.78348729 -0.30744922 -0.91461071
O  3.08484 -0.084057 -0.60423282
Si 3.82309403 1.35396206 -0.07693965
C  -1.76392729 0.88147376 -0.33245493
C  -2.55127343 -1.37904436 0.4696092
C  -3.00812628 0.04353791 0.04911689
C  0.75392332 0.40467583 -0.27025898
C  5.59674258 1.09085886 -0.70831701
C  3.86459285 1.51365834 1.78938905
C  3.06312639 2.84088184 -0.92753533
H  -0.85620575 -0.62585109 1.68385563
H  -0.54350566 -3.20232193 -0.00097091
H  -0.14683698 -2.2078522 -3.00563183
H  -1.44977161 1.521933 0.4949259
H  -1.98540385 1.51340421 -1.19721605
H  2.27520598 -1.89181912 -2.31399952
H  -2.6564684 -2.06596485 -0.37753043
H  -3.19861875 -1.73983312 1.2731432
O  0.94036529 1.2497378 0.65676382
H  2.17075722 3.17093737 -0.39044002
H  2.76862783 2.59002881 -1.95357032
H  3.77527718 3.67308016 -0.98019378
H  4.44499551 0.71027306 2.25737075
H  2.84722993 1.50045768 2.18703513
H  4.33283441 2.46529764 2.07074711
C  5.62352317 1.20919955 -2.2378068
H  6.6336563 1.0075577 -2.62275164
H  4.93984837 0.49231311 -2.70907921
H  5.33883689 2.21416432 -2.57175349
C  6.10147214 -0.30196802 -0.30853399
H  7.14628626 -0.43591664 -0.62473597
H  6.06617161 -0.45644964 0.77767356
H  5.50604529 -1.09136695 -0.78006146
C  6.52407428 2.1530909 -0.10232679
H  7.53942219 2.05356966 -0.51213073
H  6.18255531 3.17283763 -0.32202624
H  6.59833325 2.05207164 0.98695468
N  0.98812766 -2.46079757 1.14213536
C  1.53393472 -1.59865304 2.20296496
C  1.9446772 -3.48138575 0.70804688
C  2.87697963 -2.25721676 2.53416042
H  1.64965608 -0.57076793 1.8411848
C  3.27608658 -2.93583996 1.21883244
H  1.70150968 -4.44943156 1.16470899
H  2.74392065 -3.00996953 3.3185299
H  4.0252125 -3.72016415 1.34726508
H  3.61233499 -1.52729216 2.88043268
H  3.65620164 -2.18741084 0.51561642
H  1.89747216 -3.58408837 -0.38134402
H  0.84205569 -1.58671169 3.0529717
C  -3.71005149 0.74669126 1.20716752
O  -3.71742707 0.37057766 2.35440565
O  -4.28088089 1.87841107 0.78696446
C  -3.99823936 -0.05327051 -1.10529482
O  -3.83394891 0.37400206 -2.22142368
O  -5.09317562 -0.71281841 -0.71113086
C  -4.93680179 2.67303918 1.79621263
C  -5.51103903 3.8877566 1.1057406
H  -4.20023233 2.94293054 2.55821433
H  -5.71233917 2.06308057 2.26796046
H  -6.01973169 4.51901449 1.83952889
H  -4.71889095 4.47431402 0.63241607
H  -6.2343144 3.59198953 0.34073384
C  -6.11978698 -0.88886528 -1.70738912
C  -7.25886896 -1.6331128 -1.05081664
H  -5.69694851 -1.44468707 -2.54917535
H  -6.42710832 0.09715554 -2.0674897
H  -8.06296583 -1.78541208 -1.77604523
H  -6.92645324 -2.61058044 -0.6903903
H  -7.65640204 -1.06395333 -0.20593217
