program: Gaussian 16
title: Title Card Required
version: ES64L-G16RevA.03
method: RB3LYP
basis: GenECP
operation: Freq
keyword: #N
keyword: Geom=AllCheck
keyword: Guess=TCheck
keyword: SCRF=Check
keyword: GenChk
keyword: RB3LYP/GenECP
keyword: Freq
converged: YES YES NO YES
title: Mulliken charges:
elementType: P C H H C H H C H H P C C C C H C H C H H H C C C C H C H C H H H C C C C H C H C H H H C C C C H C H C H H H Pd C C C C C C H H H H H Cu B C C O O C N N C C C C C H H H H H H H H C C C C C C H H H H H H C H H H C H H H C H H H C H H H C H H C O S O O C F F F O
charge: 0.639697 -0.393173 0.144825 0.132612 -0.207195 0.109520 0.135691 -0.390942 0.137298 0.137914 0.633205 -0.120349 -0.108932 -0.126673 -0.085316 0.124859 -0.087280 0.112882 -0.086337 0.095683 0.093809 0.090088 -0.143553 -0.089116 -0.098749 -0.085899 0.084960 -0.084924 0.163492 -0.089989 0.083800 0.130334 0.089367 -0.083304 -0.109714 -0.080856 -0.077510 0.077214 -0.067118 0.109664 -0.086929 0.084206 0.092747 0.087056 -0.104326 -0.092057 -0.120917 -0.078657 0.078452 -0.077551 0.148924 -0.088358 0.085233 0.134438 0.091372 -0.641658 -0.095513 -0.043579 -0.103268 -0.080991 -0.101250 -0.057102 0.073976 0.077870 0.067920 0.067224 0.132578 0.071515 0.568943 -0.172524 -0.217992 -0.469309 -0.488286 0.258965 -0.373848 -0.386724 0.048398 0.037876 0.243134 0.248345 -0.178685 0.123329 0.116883 0.164508 0.133856 0.110417 0.195913 0.102722 0.193162 0.107075 -0.124879 -0.103872 -0.098059 -0.111244 -0.080117 0.091613 0.082562 0.144777 0.073811 0.073728 0.116369 -0.316151 0.093713 0.119174 0.119933 -0.317476 0.116503 0.099317 0.111748 -0.320216 0.106574 0.103471 0.115875 -0.313190 0.103151 0.107967 0.111562 -0.329252 0.094682 0.129453 0.352503 -0.373479 1.282103 -0.551581 -0.571916 0.676028 -0.264902 -0.255761 -0.269636 -0.622382
chargesum: -0.00000
title: Mulliken charges with hydrogens summed into heavy atoms:
elementType: P C C C P C C C C C C C C C C C C C C C C C C C C C C C C Pd C C C C C C Cu B C C O O C N N C C C C C C C C C C C C C C C C C O S O O C F F F O
charge: 0.639697 -0.115736 0.038016 -0.115730 0.633205 -0.120349 0.015927 -0.013791 0.010367 0.006528 0.003751 -0.143553 -0.004156 0.064743 -0.002098 0.045410 -0.000622 -0.083304 -0.032499 0.028808 0.006696 0.025629 0.000127 -0.104326 -0.013606 0.028007 0.006576 0.056888 0.003014 -0.641658 -0.021536 -0.043579 0.029310 -0.003121 -0.033329 0.010121 0.071515 0.568943 -0.027748 0.273804 -0.469309 -0.488286 0.258965 -0.373848 -0.386724 0.171728 0.154759 0.243134 0.248345 0.230095 0.107075 -0.033266 -0.030061 -0.024331 0.005125 0.002445 0.016669 0.010092 0.005704 0.009489 -0.105117 0.352503 -0.373479 1.282103 -0.551581 -0.571916 0.676028 -0.264902 -0.255761 -0.269636 -0.622382
chargesum: -0.00003
1716.lowfreq: -5.6718 -0.0055 -0.0046 -0.0031 2.8617 4.8785 13.3007 14.4604 18.7503
temp: 298.150 k
press: 1.00000 atm
elementType: 15 6 1 1 6 1 1 6 1 1 15 6 6 6 6 1 6 1 6 1 1 1 6 6 6 6 1 6 1 6 1 1 1 6 6 6 6 1 6 1 6 1 1 1 6 6 6 6 1 6 1 6 1 1 1 46 6 6 6 6 6 6 1 1 1 1 1 29 5 6 6 8 8 6 7 7 6 6 6 6 6 1 1 1 1 1 1 1 1 6 6 6 6 6 6 1 1 1 1 1 1 6 1 1 1 6 1 1 1 6 1 1 1 6 1 1 1 6 1 1 6 8 16 8 8 6 9 9 9 8
symmnumber: 1
zpe: 2721059.2 jmol-1
zpe.correction: 1.036397 hartree
zpe.thermalcorrener: 1.108144 hartree
zpe.thermalcorrenthalpy: 1.109089 hartree
zpe.thermalcorrgfe: 0.923887 hartree
zpe.sumelectzpe: -4381.835238 hartree
zpe.sumelectthermal: -4381.763490 hartree
zpe.sumelectthermalent: -4381.762546 hartree
zpe.sumelectthermalfe: -4381.947747 hartree
dipole: -8.8950 3.9633 5.8220
dipole: 11.3457
quadrupole: -435.9256 -419.2092 -433.1144
quadrupole: 24.9854 -0.4558 8.4972
quadrupole: -6.5092 10.2072 -3.6980 24.9854 -0.4558 8.4972
hfenergy: -4382.8716347 hartree
pointgroup: C01 [X(C54H59B1Cu1F3N2O6P2Pd1S1)]
dipole: 3.494135 -1.5593668 2.2987456 debye
polarizability: 739.3535336|35.3938135|697.5094527|24.247886|21.8990701|683.3762041 unknown
InChI: InChI=1S/C27H26P2.C15H20BO3.C6H5.C5H8N2.CHF3O3S.Cu.Pd/c1-5-14-24(15-6-1)28(25-16-7-2-8-17-25)22-13-23-29(26-18-9-3-10-19-26)27-20-11-4-12-21-27;1-14(2)15(3,4)19-16(18-14)10-13(11-17)12-8-6-5-7-9-12;1-2-4-6-5-3-1;1-6-3-4-7(2)5-6;2-1(3,4)8(5,6)7;;/h1-12,14-21H,13,22-23H2;5-9,13H,10H2,1-4H3;1-5H;3-4H,1-2H3;5H;;/q;;;;;+1;/p-1
charge 0 multiplicity 1
130 atoms
P  0.10931431 -0.42326841 1.94800707
C  0.47458408 -2.01895139 2.84843105
H  1.22378365 -2.56533943 2.26529306
H  0.94077299 -1.75699919 3.80211837
C  -0.74570043 -2.91141141 3.11133493
H  -0.46061758 -3.64032063 3.87916295
H  -1.55708219 -2.31688814 3.54111433
C  -1.24200197 -3.69763966 1.89527197
H  -1.95580049 -4.46989511 2.19826963
H  -0.39338696 -4.217958 1.43922148
P  -1.99742631 -2.68189808 0.54247787
C  1.53572628 0.6004797 2.51295646
C  1.3668907 1.98989984 2.60413183
C  2.76350972 0.03920885 2.88926773
C  2.40212178 2.7972353 3.0695632
H  0.41794939 2.43637156 2.32551115
C  3.80188839 0.8526919 3.3479397
H  2.9447618 -1.02464984 2.80184065
C  3.62354225 2.23196736 3.44431557
H  2.25297641 3.87038202 3.14340317
H  4.74961391 0.39972846 3.62206073
H  4.42776743 2.86369986 3.80942
C  -1.21749865 0.29540274 2.98603118
C  -1.11180342 0.30512464 4.38813315
C  -2.3330064 0.87067466 2.37739049
C  -2.12463666 0.86632263 5.15914433
H  -0.23578286 -0.11276364 4.87518372
C  -3.34316895 1.44788179 3.15119904
H  -2.40970729 0.88283267 1.30009742
C  -3.24245236 1.43856654 4.53965
H  -2.04140698 0.86676433 6.24210973
H  -4.19009348 1.89870736 2.64647274
H  -4.02770724 1.88148402 5.14535542
C  -2.57620761 -3.97883206 -0.61854648
C  -1.86913688 -5.17740446 -0.78381563
C  -3.69045033 -3.72982499 -1.43150941
C  -2.27024621 -6.10947236 -1.74065436
H  -0.9951778 -5.39229812 -0.1790485
C  -4.08035099 -4.6564278 -2.39392927
H  -4.24193332 -2.80357805 -1.32687069
C  -3.37375534 -5.84951221 -2.55159766
H  -1.71386183 -7.03521708 -1.8544887
H  -4.93454093 -4.4400335 -3.02755597
H  -3.67907581 -6.56945737 -3.30479593
C  -3.55333959 -2.01347361 1.2241018
C  -4.17344839 -2.54806198 2.36148216
C  -4.14890259 -0.93201255 0.55872109
C  -5.36881071 -2.00289017 2.82733788
H  -3.73226302 -3.38633671 2.8899862
C  -5.35545699 -0.40281946 1.01429417
H  -3.65177546 -0.47298598 -0.28825732
C  -5.96266849 -0.93509263 2.15180293
H  -5.8359505 -2.41351951 3.7176533
H  -5.7752847 0.45870886 0.50846359
H  -6.89127837 -0.5096827 2.52050973
Pd -0.4846172 -1.0208459 -0.38208878
C  -0.74453421 -2.7818584 -2.83602211
C  -1.21045984 -1.63215457 -2.19506932
C  -2.22300454 -0.8754776 -2.79251311
C  -2.77817468 -1.28614285 -4.00876691
C  -2.31616247 -2.43942891 -4.64449536
C  -1.29241318 -3.18398805 -4.05659212
H  0.0406455 -3.38187784 -2.38403783
H  -3.5724007 -0.69568569 -4.45928824
H  -2.74896288 -2.75555832 -5.58946236
H  -0.92492634 -4.08484726 -4.54088762
H  -2.57320649 0.03818002 -2.3236009
Cu -0.30532715 1.57108258 -0.81859239
B  4.17615497 -1.87936872 -0.09363001
C  2.4658919 -0.53488017 -1.5240162
C  -0.91525648 2.77795911 -3.77478916
O  5.12030004 -2.12928369 -1.05286449
O  4.67955617 -1.94426724 1.18681248
C  0.36496752 3.21152772 -1.67663307
N  0.02086585 3.54471648 -2.94906378
N  1.14992543 4.23920515 -1.26566275
C  0.57503444 4.7579956 -3.31946559
C  1.29179629 5.20031302 -2.2524057
C  6.42089361 -2.11152374 -0.39987935
C  6.04912407 -2.42509756 1.09776493
C  1.67094816 4.35006713 0.08365937
H  0.41945945 5.18758804 -4.29592848
H  1.88952207 6.08671847 -2.11505274
H  1.9403469 3.35794467 0.43454862
H  0.91561963 4.78403732 0.7454499
H  2.56607662 4.97321561 0.07973257
H  -0.73551742 1.71591756 -3.61578987
H  -0.73175466 3.02049465 -4.82352411
H  -1.94035771 3.03374534 -3.4983192
C  3.22683792 0.77677675 -1.39131485
C  3.81554711 1.18612413 -0.19090254
C  4.52920948 2.38555899 -0.11198836
C  4.64683166 3.20770686 -1.2300601
C  3.34353553 1.61927778 -2.50910267
C  4.04081273 2.82068999 -2.42932147
H  3.73592676 0.57230259 0.69395461
H  4.11179057 3.45815271 -3.30566401
H  2.79606394 -1.00182296 -2.45896321
H  4.97747204 2.67234962 0.83439699
H  5.20211795 4.13970014 -1.17193758
H  2.86168776 1.32894481 -3.43540886
C  6.9905698 -0.70498941 -0.60384548
H  8.00415546 -0.62038651 -0.20139741
H  7.02347043 -0.49298799 -1.6752593
H  6.35789232 0.05379912 -0.13877416
C  7.3147871 -3.14762446 -1.06995726
H  7.49660342 -2.85574146 -2.10753684
H  8.28155515 -3.21163451 -0.56021885
H  6.85345674 -4.136234 -1.07274016
C  6.88328786 -1.68299371 2.13504778
H  6.54059902 -1.94704647 3.1397735
H  7.93975851 -1.95736646 2.05472433
H  6.7926129 -0.60230711 2.01529863
C  6.00805764 -3.92229244 1.41252425
H  7.01028933 -4.35929255 1.43066534
H  5.55080871 -4.06549564 2.39524411
H  5.40700522 -4.46129136 0.67534007
C  2.67659684 -1.5343335 -0.38523657
H  2.22681892 -1.15465772 0.53152836
H  2.12415891 -2.45211393 -0.63034763
C  0.96442615 -0.19555114 -1.80447913
O  0.71870614 0.23865565 -2.9154802
S  -3.37737686 2.79683668 -0.63594444
O  -3.62078754 3.42004382 -1.94397079
O  -4.53923644 2.54249986 0.23163546
C  -2.40997842 4.10271512 0.31335866
F  -3.24574924 4.86751253 1.02002956
F  -1.71458179 4.89425794 -0.5162777
F  -1.53119775 3.54184346 1.17862001
O  -2.43729416 1.61726193 -0.68820217
