program: Gaussian 16
title: Title Card Required
version: ES64L-G16RevA.03
method: RB3LYP
basis: GenECP
operation: Freq
keyword: #N
keyword: Geom=AllCheck
keyword: Guess=TCheck
keyword: SCRF=Check
keyword: GenChk
keyword: RB3LYP/GenECP
keyword: Freq
converged: YES YES NO YES
title: Mulliken charges:
elementType: P C H H C H H C H H P C C C C H C H C H H H C C C C H C H C H H H C C C C H C H C H H H C C C C H C H C H H H Pd C C C C C C H H H H I H Cu B C C O O C N N C C C C C H H H H H H H H C C C C C C H H H H H H C H H H C H H H C H H H C H H H C H H C O
charge: 0.676616 -0.396967 0.155092 0.126616 -0.201815 0.105291 0.125350 -0.390298 0.138363 0.139642 0.639223 -0.134851 -0.098555 -0.130940 -0.090846 0.146377 -0.096785 0.123590 -0.094679 0.097513 0.085654 0.087124 -0.150217 -0.086578 -0.064723 -0.089993 0.089516 -0.062472 0.150677 -0.087527 0.082531 0.096671 0.085004 -0.083771 -0.111309 -0.093822 -0.081097 0.085987 -0.071967 0.102819 -0.087558 0.089546 0.091035 0.089284 -0.100640 -0.093681 -0.113854 -0.073816 0.085007 -0.086653 0.138061 -0.087310 0.088661 0.100541 0.091250 -0.661351 -0.102762 -0.020885 -0.097753 -0.079596 -0.101277 -0.067386 0.077158 0.078204 0.068173 0.066699 -0.428551 0.128435 -0.053480 0.573802 -0.160461 -0.167300 -0.466695 -0.486197 0.291753 -0.397557 -0.379961 0.042008 0.041438 0.239286 0.248510 -0.179547 0.115396 0.113920 0.188197 0.105939 0.131648 0.143380 0.099122 0.183858 0.097029 -0.072979 -0.103579 -0.084304 -0.125319 -0.085338 0.091132 0.079766 0.119291 0.083001 0.077931 0.085999 -0.316178 0.091272 0.111980 0.131411 -0.315867 0.114486 0.099370 0.109603 -0.327447 0.107636 0.102869 0.123841 -0.313031 0.103411 0.108852 0.110352 -0.332958 0.130085 0.112777 0.334932 -0.386513
chargesum: -0.00000
title: Mulliken charges with hydrogens summed into heavy atoms:
elementType: P C C C P C C C C C C C C C C C C C C C C C C C C C C C C Pd C C C C C C I Cu B C C O O C N N C C C C C C C C C C C C C C C C C O
charge: 0.676616 -0.115258 0.028826 -0.112293 0.639223 -0.134851 0.047821 -0.007350 0.006668 -0.011130 -0.007555 -0.150217 0.002938 0.085954 -0.007461 0.034199 -0.002523 -0.083771 -0.025322 0.008998 0.008449 0.019068 0.001726 -0.100640 -0.008673 0.024207 0.014845 0.013888 0.003939 -0.661351 -0.025604 -0.020885 0.030683 -0.001392 -0.033104 -0.000687 -0.428551 -0.053480 0.573802 -0.041170 0.259060 -0.466695 -0.486197 0.291753 -0.397557 -0.379961 0.157403 0.155359 0.239286 0.248510 0.246237 0.097029 0.018153 -0.020578 -0.006373 -0.039321 -0.005572 0.018485 0.007592 0.006899 0.009583 -0.090095 0.334932 -0.386513
chargesum: -0.00002
1716.lowfreq: -46.8426 -2.0727 -0.0025 -0.0018 0.0002 3.6547 4.9188 19.3158 21.3279
temp: 298.150 k
press: 1.00000 atm
elementType: 15 6 1 1 6 1 1 6 1 1 15 6 6 6 6 1 6 1 6 1 1 1 6 6 6 6 1 6 1 6 1 1 1 6 6 6 6 1 6 1 6 1 1 1 6 6 6 6 1 6 1 6 1 1 1 46 6 6 6 6 6 6 1 1 1 1 53 1 29 5 6 6 8 8 6 7 7 6 6 6 6 6 1 1 1 1 1 1 1 1 6 6 6 6 6 6 1 1 1 1 1 1 6 1 1 1 6 1 1 1 6 1 1 1 6 1 1 1 6 1 1 6 8
symmnumber: 1
zpe: 2645984.0 jmol-1
zpe.correction: 1.007802 hartree
zpe.thermalcorrener: 1.072179 hartree
zpe.thermalcorrenthalpy: 1.073123 hartree
zpe.thermalcorrgfe: 0.905418 hartree
zpe.sumelectzpe: -3431.823539 hartree
zpe.sumelectthermal: -3431.759162 hartree
zpe.sumelectthermalent: -3431.758218 hartree
zpe.sumelectthermalfe: -3431.925924 hartree
dipole: -4.4667 6.6300 5.8086
dipole: 9.8817
quadrupole: -363.7896 -423.4474 -402.1668
quadrupole: 15.0042 7.3264 -2.0177
quadrupole: 32.6783 -26.9795 -5.6988 15.0042 7.3264 -2.0177
hfenergy: -3432.8313412 hartree
pointgroup: C01 [X(C53H59B1Cu1I1N2O3P2Pd1)]
dipole: -1.2575006 2.5143634 2.6853983 debye
polarizability: 809.0267178|-20.4157809|658.7917732|-25.3178305|-51.9117708|674.5068199 unknown
InChI: InChI=1S/C27H26P2.C15H20BO3.C6H5.C5H8N2.Cu.HI.Pd/c1-5-14-24(15-6-1)28(25-16-7-2-8-17-25)22-13-23-29(26-18-9-3-10-19-26)27-20-11-4-12-21-27;1-14(2)15(3,4)19-16(18-14)10-13(11-17)12-8-6-5-7-9-12;1-2-4-6-5-3-1;1-6-3-4-7(2)5-6;;;/h1-12,14-21H,13,22-23H2;5-9,13H,10H2,1-4H3;1-5H;3-4H,1-2H3;;1H;/q;;;;+1;;/p-1
charge 0 multiplicity 1
123 atoms
P  0.3621547 -0.50524746 1.76158065
C  0.58190375 0.92672995 2.95276011
H  -0.08135492 1.73584406 2.63234309
H  0.21988278 0.59392038 3.92989026
C  2.02328475 1.42842881 3.10295808
H  2.04214196 2.12525322 3.95022693
H  2.67205363 0.59325365 3.37974551
C  2.59421694 2.17375999 1.89274407
H  3.53089751 2.67553318 2.15744197
H  1.89637311 2.96402184 1.59912221
P  2.89067345 1.20269178 0.33411253
C  -1.11943073 -1.29392025 2.52591481
C  -1.17270114 -2.68703987 2.68199425
C  -2.16969587 -0.50861739 3.02628263
C  -2.24317507 -3.27775664 3.35267304
H  -0.37906654 -3.30602051 2.27873804
C  -3.24977251 -1.10793225 3.67672328
H  -2.15143743 0.56952816 2.91023255
C  -3.28459228 -2.49273481 3.85191118
H  -2.26452852 -4.35635486 3.47690376
H  -4.0543944 -0.48662335 4.05964183
H  -4.11705005 -2.95655877 4.37280719
C  1.68083484 -1.64062729 2.35507901
C  1.81639568 -1.91365333 3.72759683
C  2.56914363 -2.23064862 1.45397942
C  2.83435186 -2.74471218 4.18472668
H  1.11736407 -1.48450349 4.43895029
C  3.58150598 -3.07642146 1.9114239
H  2.45395417 -2.04792071 0.39492489
C  3.72119591 -3.32741264 3.27292224
H  2.93259041 -2.94526785 5.24760101
H  4.25895751 -3.52866428 1.19647196
H  4.51311531 -3.9802933 3.62815752
C  3.49567249 2.57234376 -0.73228313
C  2.67720203 3.69944096 -0.90513457
C  4.70629536 2.50559975 -1.43002034
C  3.06111736 4.73501775 -1.75330634
H  1.71883528 3.75933967 -0.40092919
C  5.0849136 3.53881753 -2.28732988
H  5.35254186 1.64392811 -1.31629828
C  4.26654507 4.65520927 -2.45304346
H  2.41263158 5.59733295 -1.87731302
H  6.02340225 3.46600605 -2.82853969
H  4.56320786 5.45636973 -3.12305682
C  4.39156264 0.20595293 0.63732928
C  5.11279859 0.243761 1.83638438
C  4.80147112 -0.6708068 -0.38215042
C  6.2200783 -0.58501837 2.01851134
H  4.81408595 0.90789667 2.63914613
C  5.92112905 -1.47942233 -0.20443075
H  4.23638692 -0.72302207 -1.30779452
C  6.62939666 -1.44395995 0.99912524
H  6.76257836 -0.55708535 2.9586814
H  6.23001108 -2.14894165 -1.00147774
H  7.49247547 -2.08692568 1.14298818
Pd 0.87188384 0.16673475 -0.5725241
C  1.90137072 1.46599222 -3.17934626
C  1.75976436 0.31184493 -2.40720749
C  2.28972283 -0.89452563 -2.8809085
C  2.9928818 -0.92724241 -4.09051529
C  3.1588222 0.23611455 -4.84383633
C  2.60131096 1.43153162 -4.38778915
H  1.47274897 2.40463608 -2.84754232
H  3.40064305 -1.87125115 -4.44358982
H  3.70542204 0.20832522 -5.7823592
H  2.70912205 2.34287197 -4.9703635
I  0.43979179 -3.8511123 -0.88170601
H  2.14093822 -1.81662763 -2.32589231
Cu -1.07991433 -1.78236199 -1.27932197
B  -2.07174743 3.28143355 0.75496197
C  -1.66824056 1.82572831 -1.37711236
C  -3.21174053 -1.29535148 -4.08006402
O  -2.89344122 4.3412042 0.48360149
O  -2.24985044 2.77984488 2.0272896
C  -2.98998111 -2.20434378 -1.76190893
N  -3.7051185 -2.00193336 -2.90424751
N  -3.83260053 -2.94062791 -0.9867402
C  -4.96419036 -2.57784925 -2.82973634
C  -5.04624235 -3.17166691 -1.61185407
C  -3.89018693 4.41567069 1.54064401
C  -3.19684152 3.63574903 2.72383711
C  -3.48274519 -3.40404672 0.34461035
H  -5.67079511 -2.52471587 -3.64222252
H  -5.83839339 -3.73818365 -1.14937885
H  -2.42521293 -3.66881597 0.35396482
H  -4.08006978 -4.28472848 0.59030077
H  -3.66639009 -2.62488169 1.08483337
H  -3.28599986 -0.21736173 -3.93604943
H  -3.80361995 -1.60430051 -4.9440161
H  -2.16475219 -1.54451749 -4.23786289
C  -3.05388946 1.30357788 -1.07559357
C  -3.28683121 0.51483625 0.05672896
C  -4.55748853 0.0133026 0.33224237
C  -5.61426142 0.26443629 -0.54356828
C  -4.12085204 1.54856297 -1.94840488
C  -5.3899848 1.0308293 -1.68903386
H  -2.46664127 0.28783585 0.72006256
H  -6.20589468 1.23305569 -2.37690671
H  -1.73967444 2.44251426 -2.27746667
H  -4.71181607 -0.58258384 1.22628784
H  -6.60262729 -0.13522391 -0.33843773
H  -3.95251571 2.1566733 -2.83258544
C  -5.14722025 3.72482742 1.00610196
H  -5.97513524 3.79714053 1.71748678
H  -5.44668785 4.21507085 0.07673533
H  -4.96451541 2.67342029 0.78258836
C  -4.17863339 5.88481545 1.8278233
H  -4.63202383 6.34497964 0.94604937
H  -4.88043647 5.985117 2.66197416
H  -3.26851542 6.43693656 2.06694621
C  -4.13198512 2.74643826 3.53662757
H  -3.56607432 2.23918349 4.32356288
H  -4.91742995 3.34034086 4.01400463
H  -4.5982623 1.98823069 2.90582059
C  -2.36929337 4.53112069 3.6485269
H  -3.00434741 5.17663828 4.26144486
H  -1.77572813 3.89863058 4.31423423
H  -1.68269011 5.16041658 3.07616256
C  -1.03202735 2.66438415 -0.23952219
H  -0.34015363 2.0280236 0.32239472
H  -0.42463861 3.45370387 -0.69546331
C  -0.8049232 0.58378727 -1.84127934
O  -1.02139261 0.19002464 -2.97210675
