program: Gaussian 16
title: Title Card Required
version: ES64L-G16RevA.03
method: RB3LYP
basis: GenECP
operation: Freq
keyword: #N
keyword: Geom=AllCheck
keyword: Guess=TCheck
keyword: SCRF=Check
keyword: GenChk
keyword: RB3LYP/GenECP
keyword: Freq
converged: YES YES NO YES
title: Mulliken charges:
elementType: O C C O B C H H H C H H H C H H H C H H H C C H H H C O I C C C H H N N Cu C C C C H C H C H H H C C C C C C H H H H H C H H H C H H H
charge: -0.480715 0.255415 0.246347 -0.478755 0.589968 -0.317041 0.104297 0.120516 0.093532 -0.311821 0.108233 0.094881 0.106630 -0.316446 0.096084 0.104293 0.107758 -0.320965 0.098401 0.081526 0.154252 -0.186043 -0.326991 0.101187 0.093691 0.112539 0.245678 -0.426598 -0.056618 0.282661 0.042176 0.045506 0.125004 0.125741 -0.385315 -0.396178 -0.076532 0.142639 -0.109002 -0.130596 -0.092365 0.101052 -0.092878 0.082362 -0.097985 0.092580 0.078842 0.078087 -0.060968 -0.232171 -0.011556 -0.064580 -0.090182 -0.052871 0.102541 0.112018 0.084899 0.084430 0.100910 -0.201412 0.209645 0.120772 0.133047 -0.180147 0.148511 0.170002 0.118079
chargesum: -0.00000
title: Mulliken charges with hydrogens summed into heavy atoms:
elementType: O C C O B C C C C C C C O I C C C N N Cu C C C C C C C C C C C C C C
charge: -0.480715 0.255415 0.246347 -0.478755 0.589968 0.001304 -0.002077 -0.008310 0.013214 -0.073505 -0.132113 0.245678 -0.426598 -0.056618 0.282661 0.167180 0.171247 -0.385315 -0.396178 -0.076532 0.142639 -0.007950 -0.048234 0.000215 -0.014037 -0.019898 0.041573 -0.232171 0.100462 0.020319 -0.005752 0.048038 0.262052 0.256445
chargesum: 0.00000
1716.lowfreq: -172.5193 -0.0003 -0.0000 0.0003 0.2906 4.5563 5.6867 17.9960 24.1315
frequency: -172.5182 17.5622 23.9314 26.5067 31.0960 35.4462 42.7347 43.3439 53.3186 57.0185 61.8331 76.3802 80.7326 88.9801 94.2845 105.1483 108.4279 111.2238 117.6848 125.0655 139.2187 142.0052 167.3000 178.9139 185.3567 190.2527 203.3424 208.5139 229.1930 232.0308 238.2748 253.0189 265.1986 270.5302 288.4706 295.5871 308.5880 311.9576 322.5516 334.4314 355.6253 364.9280 375.9604 389.6991 413.5764 420.8747 424.4191 448.3231 458.6258 463.2840 486.3803 521.4368 534.2461 569.9262 583.3710 584.2173 615.5734 617.4171 622.2962 626.9314 631.2951 638.9334 661.8198 667.7447 687.4699 690.9400 718.0026 718.6514 723.1047 755.5687 767.1853 805.6163 821.9494 823.4921 854.9799 857.2844 863.4868 883.8833 890.4966 899.0829 910.6692 937.0642 943.5197 948.3332 959.9012 968.1359 975.5984 979.4790 985.4208 989.2306 993.7086 1013.5524 1019.6833 1020.0257 1026.4698 1032.8101 1034.0446 1049.4743 1055.8910 1058.4778 1097.2764 1101.6623 1103.5802 1107.1077 1113.3963 1141.0626 1150.3553 1158.2225 1160.0303 1183.7477 1184.1323 1187.5628 1193.5166 1202.8601 1204.4303 1214.0757 1228.1401 1244.9714 1248.0611 1262.2090 1276.2751 1300.2420 1311.3693 1325.1135 1348.5604 1362.2035 1364.7831 1368.5352 1370.8130 1388.4778 1401.9874 1412.2173 1414.5703 1418.0255 1427.2011 1437.0818 1445.2327 1472.8241 1475.5196 1476.6215 1485.3861 1492.6046 1493.1184 1495.3357 1497.4571 1498.6396 1499.6222 1502.2213 1510.1630 1517.5853 1518.3595 1518.7820 1520.2721 1522.9606 1537.4521 1538.8242 1606.9585 1615.1315 1619.6416 1635.8832 1657.0976 1688.3124 3042.1669 3043.7985 3053.2155 3055.1683 3056.9941 3058.8405 3065.2957 3070.0012 3111.2555 3123.2130 3123.8569 3132.7047 3132.8219 3136.3215 3141.7470 3143.8164 3152.3778 3158.8547 3160.1716 3168.5517 3171.7769 3180.3857 3181.9304 3184.5588 3191.4458 3199.8836 3201.5992 3204.8074 3211.2511 3214.0428 3222.6934 3285.0730 3305.6392
redmass: 7.9577 5.8754 4.8045 4.9227 5.1622 4.5794 4.5337 5.6315 3.6548 6.1737 6.7995 4.7831 7.1573 4.9941 5.0276 1.6269 3.8199 2.6481 3.4266 3.4985 5.5407 2.0969 1.8832 5.3119 5.4610 5.0348 4.7250 4.6923 3.0629 1.6312 1.8029 1.2575 3.7517 9.0759 2.2030 1.8925 2.6771 1.3842 1.1430 3.3039 2.3802 2.9182 3.0725 2.6200 3.5376 3.0118 3.0067 4.9586 2.8179 4.7355 2.4154 3.5555 3.6672 4.6087 3.9106 3.2890 6.4431 4.0060 6.7812 4.3387 6.3359 6.4157 6.6278 3.8071 4.1182 4.4497 1.5726 1.3743 1.1885 4.7874 2.1062 1.2925 1.7386 1.5878 1.2487 4.6707 3.3434 3.0405 1.3739 1.9440 2.4183 2.2074 1.6078 1.5447 1.3574 1.3489 2.8165 1.8757 1.6902 1.2692 2.0008 5.9135 5.0760 1.3486 3.0646 1.6101 2.6359 2.8445 1.8912 2.1173 1.3273 1.5865 1.2332 1.9295 1.4532 1.9584 2.1716 1.3442 1.3145 1.0927 1.0944 2.3650 2.7354 1.1561 1.1507 1.3546 1.9474 1.7101 2.9253 1.6588 3.4226 2.8874 2.1085 2.0425 2.5404 2.3460 3.8921 3.7974 2.5604 8.0858 2.6806 1.3386 4.8229 1.2953 1.2688 1.2316 1.8696 2.0045 1.1710 1.2040 1.0525 2.0465 1.9765 1.0498 1.0536 1.0660 1.0543 1.5385 1.0577 1.0482 1.2090 1.0648 1.0577 1.0902 2.2686 1.0574 5.1972 4.4265 5.3809 5.5324 5.7957 11.9792 1.0660 1.0837 1.0357 1.0346 1.0376 1.0373 1.0384 1.0344 1.0943 1.1020 1.1018 1.1028 1.1033 1.1029 1.0993 1.1063 1.1008 1.1009 1.1072 1.1019 1.0851 1.0858 1.0880 1.1024 1.0919 1.0875 1.0950 1.0912 1.0925 1.0933 1.0968 1.0904 1.1093
irintensity: 159.5932 0.0259 0.6402 0.6456 0.3519 0.8948 0.7047 0.8971 0.7993 0.4383 1.4107 0.5980 6.2940 3.3358 0.2261 2.0178 1.4140 1.2272 1.0643 1.5826 4.9524 0.5767 1.3842 3.1748 1.7672 0.4519 7.0306 7.4004 0.7148 1.4376 1.2565 0.4847 0.9357 14.7048 1.5674 2.0326 4.7061 3.1961 0.0371 7.0501 0.4384 2.8630 1.7050 1.0877 43.2960 0.1993 5.0352 2.2312 3.8216 9.3324 2.0893 7.6511 17.8714 3.5614 4.5523 0.3046 5.5021 0.1880 40.2446 0.4634 5.7588 3.1353 12.8737 6.1008 15.7050 11.1140 47.4458 3.0792 203.9727 9.5920 8.1655 0.1029 27.9899 16.2053 0.6337 14.0077 32.9590 19.7994 15.7935 20.7251 23.4343 26.8974 7.1508 5.1447 0.7628 0.3116 32.6276 6.7315 20.8431 2.8262 34.7586 6.4529 0.7540 1.3020 9.9842 5.6856 1.2583 0.6513 1.0645 2.6762 5.6961 3.6583 8.7079 2.2576 3.9063 7.1567 11.8384 2.3590 5.8322 0.1068 1.3189 212.7809 37.2496 1.0548 3.8433 4.8872 4.7967 24.8237 25.5095 21.8493 4.1377 60.3778 15.6765 1.6010 1.0022 3.8740 3.2723 95.1455 166.8039 0.8094 187.8355 7.1881 12.9715 9.7482 14.7268 14.8756 25.8504 4.8583 28.0386 1.1724 0.7339 28.5483 15.7628 1.7902 8.7101 12.5264 7.0685 19.9279 5.8624 13.7806 13.0006 2.7391 6.4617 11.7237 23.0346 11.6170 48.2572 7.4900 16.8845 1.5000 24.9746 419.8539 20.6358 15.7171 6.0329 39.2528 13.9235 15.1212 54.7693 33.6514 8.2758 2.3433 17.5220 23.6786 16.3753 28.3846 36.2799 7.9241 18.8367 21.5773 3.5158 4.6089 1.9476 8.8047 5.8705 0.5470 17.9251 3.9359 41.9251 12.7493 15.0053 7.9420 16.6920 1.1440 0.3118
temp: 298.150 k
press: 1.00000 atm
elementType: 8 6 6 8 5 6 1 1 1 6 1 1 1 6 1 1 1 6 1 1 1 6 6 1 1 1 6 8 53 6 6 6 1 1 7 7 29 6 6 6 6 1 6 1 6 1 1 1 6 6 6 6 6 6 1 1 1 1 1 6 1 1 1 6 1 1 1
symmnumber: 1
zpe: 1437595.3 jmol-1
zpe.correction: 0.547551 hartree
zpe.thermalcorrener: 0.583730 hartree
zpe.thermalcorrenthalpy: 0.584674 hartree
zpe.thermalcorrgfe: 0.476018 hartree
zpe.sumelectzpe: -1577.937305 hartree
zpe.sumelectthermal: -1577.901126 hartree
zpe.sumelectthermalent: -1577.900182 hartree
zpe.sumelectthermalfe: -1578.008839 hartree
dipole: -2.5304 -1.9221 -4.1236
dipole: 5.2059
quadrupole: -196.2428 -220.1480 -203.6218
quadrupole: 18.3570 8.7230 1.2305
quadrupole: 10.4281 -13.4771 3.0491 18.3570 8.7230 1.2305
hfenergy: -1578.4848562 hartree
pointgroup: C01[X(C26H33B1Cu1I1N2O3)]
dipole: 1.0820303 -1.0919789 1.3534176 debye
polarizability: 435.4555895|-20.9322177|376.1407991|-38.1423665|7.1362341|314.861216 unknown
InChI: InChI=1S/C15H20BO3.C6H5I.C5H8N2.Cu/c1-14(2)15(3,4)19-16(18-14)10-13(11-17)12-8-6-5-7-9-12;7-6-4-2-1-3-5-6;1-6-3-4-7(2)5-6;/h5-9,13H,10H2,1-4H3;1-5H;3-4H,1-2H3;
charge 0 multiplicity 1
67 atoms
O  -3.85743384 -2.0355091 -0.72185449
C  -5.15407429 -1.64232717 -0.20443888
C  -4.95683935 -0.10734675 0.08341761
O  -3.91079373 0.25194131 -0.86095745
B  -3.22229498 -0.89852402 -1.15955939
C  -5.46069706 -2.49067972 1.02444352
H  -5.56179158 -3.53907265 0.72998119
H  -4.65972378 -2.41951418 1.76121898
H  -6.39976743 -2.17534319 1.49079199
C  -6.17206886 -1.92430455 -1.31398249
H  -6.10375828 -2.9781917 -1.59618834
H  -7.19553118 -1.7181823 -0.98718245
H  -5.96149412 -1.32144504 -2.20153774
C  -6.17781726 0.7614621 -0.19570246
H  -7.01391494 0.47277035 0.44959753
H  -5.93623094 1.80776018 0.01156386
H  -6.49744622 0.6874505 -1.23637374
C  -4.40818032 0.17445536 1.48440656
H  -4.12470874 1.22732377 1.54509227
H  -5.15884824 -0.03061253 2.25365105
H  -3.51058269 -0.41542871 1.67529272
C  -0.7475916 -1.65210264 -1.23361085
C  -1.89446141 -0.9436583 -2.00048593
H  -2.07914117 -1.49451211 -2.93193598
H  -1.58950673 0.06811065 -2.28177347
H  -1.12041966 -2.62239473 -0.8813084
C  -0.43349741 -0.80848567 0.0472748
O  -1.29019389 -0.7732203 0.9225058
I  2.67120558 2.32549037 -0.71153983
C  2.59959468 -0.91382206 1.39566154
C  4.20989042 -2.31752813 2.16061162
C  3.29239214 -2.17195423 3.15301539
H  5.11696086 -2.89889298 2.11505698
H  3.2518859 -2.59113597 4.14572767
N  2.31526183 -1.31839192 2.66318624
N  3.76910827 -1.53748047 1.10118313
Cu 1.32892429 0.10608588 0.24558834
C  0.5050087 -1.85928418 -2.04047105
C  1.17387998 -0.76649583 -2.61510843
C  1.08756315 -3.12632316 -2.16200518
C  2.37516526 -0.93832223 -3.303943
H  0.74338248 0.22582036 -2.53728259
C  2.28611391 -3.30610061 -2.85580929
H  0.58994314 -3.98107229 -1.71104123
C  2.93424947 -2.21082333 -3.43201297
H  2.87295959 -0.07453259 -3.73472611
H  2.71036387 -4.30196432 -2.95077885
H  3.86478278 -2.34836493 -3.9752626
C  -0.55647206 2.35940636 -0.82537084
C  0.47594233 2.09807979 0.08693023
C  0.31989699 2.37483025 1.45114649
C  -0.93082401 2.79442478 1.91501455
C  -1.98510406 2.98927777 1.02746776
C  -1.79206446 2.76896781 -0.34332826
H  -0.40593251 2.19210613 -1.88541848
H  1.15241578 2.2544175 2.13593163
H  -1.06546322 2.9852977 2.97614464
H  -2.94937419 3.32828173 1.39129653
H  -2.618843 2.89147415 -1.03482587
C  1.13480116 -0.87799227 3.40068624
H  0.32559535 -0.67585029 2.69632348
H  0.82420983 -1.67028952 4.08493535
H  1.35599886 0.02655059 3.97545709
C  4.39940581 -1.47668342 -0.211241
H  4.15343257 -2.36612697 -0.79618081
H  4.01568233 -0.60233892 -0.73464375
H  5.48271992 -1.39093539 -0.0975976
