program: Gaussian 16
title: Title Card Required
version: ES64L-G16RevA.03
method: RB3LYP
basis: GenECP
operation: Freq
keyword: #N
keyword: Geom=AllCheck
keyword: Guess=TCheck
keyword: SCRF=Check
keyword: GenChk
keyword: RB3LYP/GenECP
keyword: Freq
converged: YES YES YES YES
title: Mulliken charges:
elementType: P C H H C H H C H H P C C C C H C H C H H H C C C C H C H C H H H C C C C H C H C H H H C C C C H C H C H H H Pd C C C C C C H H H H H C O Cl
charge: 0.635948 -0.381084 0.187288 0.131976 -0.211799 0.112322 0.112382 -0.369527 0.122375 0.180308 0.619568 -0.112384 -0.101043 -0.080491 -0.084897 0.093427 -0.086073 0.163700 -0.081805 0.084649 0.098355 0.087526 -0.107134 -0.097865 -0.105043 -0.075294 0.093626 -0.083810 0.119298 -0.086482 0.093333 0.093988 0.092868 -0.114089 -0.104123 -0.107666 -0.094952 0.145511 -0.083720 0.096669 -0.088936 0.097347 0.085625 0.087793 -0.137179 -0.095887 -0.096039 -0.084231 0.096385 -0.069262 0.135897 -0.087908 0.091695 0.090299 0.090843 -0.556772 -0.069682 -0.023519 -0.068099 -0.086508 -0.078484 -0.074057 0.181523 0.093293 0.095316 0.112520 0.107764 0.311593 -0.342974 -0.514190
chargesum: -0.00000
title: Mulliken charges with hydrogens summed into heavy atoms:
elementType: P C C C P C C C C C C C C C C C C C C C C C C C C C C C C Pd C C C C C C C O Cl
charge: 0.635948 -0.061820 0.012906 -0.066844 0.619568 -0.112384 -0.007617 0.083209 -0.000248 0.012282 0.005721 -0.107134 -0.004239 0.014255 0.018038 0.010178 0.006386 -0.114089 0.041389 -0.010997 0.002396 0.001904 -0.001144 -0.137179 0.000498 0.039858 0.007464 0.021037 0.002935 -0.556772 0.111841 -0.023519 0.039665 0.006786 0.016832 0.038463 0.311593 -0.342974 -0.514190
chargesum: 0.00000
1716.lowfreq: -7.8368 -1.2940 0.0003 0.0007 0.0014 8.2633 16.0240 20.4749 24.7992
frequency: 14.7354 20.3894 24.7285 31.1513 34.3640 37.4594 48.3344 49.6834 54.4615 58.9603 62.5907 63.2911 70.1654 78.7776 88.3263 90.4662 102.6909 106.7095 112.6993 116.6279 148.1166 173.6082 179.0300 186.4001 192.8316 203.1984 206.1964 216.8299 218.8928 229.8187 253.2654 257.5092 262.5584 270.7990 274.3268 275.6686 353.2366 359.9219 405.5626 409.9511 410.6138 416.4073 423.0339 425.6570 432.9983 438.5560 446.2115 462.4810 488.5290 489.0589 493.5471 497.7931 523.0945 532.3684 598.9768 631.6087 631.9867 632.7074 633.9860 634.7181 653.3974 662.1841 688.5272 708.0456 709.4711 710.1459 711.8156 713.7688 718.3612 719.7475 728.9677 732.6179 750.9548 759.3896 762.4737 763.4604 766.4392 804.3592 815.9017 846.7182 861.4466 864.3111 866.9763 870.0814 877.7485 929.3784 933.5274 942.2290 942.5627 945.4318 948.9620 979.7597 981.4533 985.9713 989.9506 993.4406 1002.2134 1004.3470 1006.1097 1009.3520 1010.2240 1015.7499 1017.4136 1018.2307 1020.7077 1022.5552 1025.7323 1052.8446 1055.1635 1056.1252 1056.3664 1057.0533 1068.4114 1104.4108 1107.6590 1112.4765 1114.2729 1115.1528 1126.0262 1127.4342 1129.4769 1131.5738 1143.3131 1148.5252 1188.9535 1189.9780 1189.9958 1190.3240 1191.3445 1196.7198 1211.4179 1211.7199 1217.0856 1223.2496 1226.5450 1272.1664 1308.4762 1329.5026 1331.2427 1333.0358 1335.1073 1336.5715 1344.2495 1361.5130 1365.7576 1371.2459 1373.9275 1377.1003 1394.7264 1458.9079 1471.8440 1475.6607 1477.6653 1478.5127 1480.3748 1480.5513 1509.6226 1515.6597 1526.3585 1528.8783 1530.9870 1532.9174 1611.0935 1627.8320 1629.8136 1630.9851 1631.1581 1642.0681 1647.7587 1648.3849 1648.6960 1649.4162 1877.5873 3044.7633 3054.0464 3059.9887 3091.2305 3110.7125 3120.0639 3168.5568 3174.8610 3179.8068 3182.4222 3183.0817 3183.1908 3185.6607 3188.9437 3191.7904 3192.0532 3193.5773 3195.0266 3196.8530 3197.9824 3198.1959 3204.7557 3205.0165 3205.2229 3207.3367 3208.8023 3211.1045 3212.0175 3215.6168 3218.2793 3218.3776
redmass: 5.6239 6.0315 5.3462 5.5082 5.1246 5.5658 5.5693 4.9902 4.9934 4.3091 5.4304 6.9824 4.6813 6.7191 6.0144 5.1006 7.4691 13.2978 6.9339 7.5764 4.1095 6.8002 6.7705 7.2317 6.8049 3.3655 5.1039 4.5769 4.1696 4.1491 5.5600 5.1075 4.9321 5.2033 3.4408 7.8627 4.3618 3.4310 2.9312 2.9749 2.9986 2.9155 3.0851 3.2380 4.7162 5.8634 4.7003 8.0169 4.2484 4.0326 4.7398 5.0611 5.1038 4.2515 8.0199 6.2036 6.2677 6.3746 6.4342 6.6302 4.4902 5.9156 4.7643 2.5270 2.6621 2.2055 2.5562 2.9855 3.5380 3.6919 5.8177 4.7043 1.6867 1.6712 1.6080 1.6035 1.5850 4.2535 1.5701 2.3053 1.2512 1.2459 1.2478 1.2444 1.2438 1.8204 1.3380 1.3279 1.3027 1.3402 1.3474 1.3638 1.3423 1.3568 1.3185 1.3173 1.2655 1.2658 1.8649 1.3016 5.5646 2.8866 1.8102 2.6212 5.9997 6.0191 1.6051 2.3188 2.6828 2.7784 2.7857 2.8637 2.5032 1.7533 1.5878 1.6334 1.6702 1.6756 2.8613 2.8844 2.7276 2.9463 1.1279 3.3634 1.0976 1.0982 1.0981 1.0980 1.1069 1.1895 1.1579 1.1476 1.1452 1.1549 1.1638 1.2530 1.4032 2.5619 2.6332 2.7466 3.1694 3.0495 1.2924 2.1138 1.9048 1.9849 1.6154 1.5252 1.3341 1.0881 2.1596 1.3327 1.8612 1.8953 2.1264 2.1256 1.0793 1.9721 2.0748 2.0501 1.9885 1.9616 4.7220 5.1300 5.2014 5.2526 5.3587 5.2258 5.1821 5.3060 5.3632 5.4086 13.1717 1.0647 1.0603 1.0595 1.1003 1.1030 1.1046 1.0925 1.0918 1.0865 1.0860 1.0852 1.0863 1.0858 1.0875 1.0909 1.0879 1.0905 1.0899 1.0907 1.0906 1.0916 1.0943 1.0934 1.0949 1.0951 1.0952 1.0978 1.0956 1.0974 1.0964 1.0953
irintensity: 0.1895 0.5882 0.2102 0.0211 0.1416 0.0562 0.0372 0.0313 0.3326 0.2743 0.5617 2.9568 0.3829 0.6691 3.0062 0.8319 0.5486 10.3874 0.2835 1.6704 0.3392 3.0897 10.0909 19.3389 4.8616 0.5509 2.5130 1.7978 0.7260 0.3970 2.0781 1.2703 1.8839 0.5361 1.1339 1.2380 1.2857 3.6544 0.1832 0.1397 0.1622 0.4116 4.2114 2.0377 1.3370 12.6640 3.6978 1.0129 12.9828 8.1603 2.9592 52.3791 107.0673 4.9046 29.1352 3.4413 2.4681 0.6827 6.7175 12.6746 43.8960 74.9241 1.5179 16.6519 25.2864 32.1473 9.9233 19.3390 8.9195 28.0990 13.5067 2.5802 67.7341 18.4477 4.4510 26.4293 2.8125 64.6430 24.8186 17.8826 0.9983 0.7430 1.2060 0.2873 3.0192 4.4439 0.4552 1.2004 0.5708 0.6049 0.6221 0.0894 0.1305 0.9825 0.0399 1.1818 0.3949 0.2321 49.0057 0.1890 0.1655 0.0596 0.5679 0.6701 0.5541 1.1133 3.4730 1.1386 0.3649 0.3099 1.3426 1.0117 5.0060 0.9522 0.4792 1.4915 0.1593 0.8916 11.3911 22.6886 7.9950 30.1715 0.6347 27.8642 0.3488 0.2996 0.4305 0.4518 0.5340 23.0347 3.7166 1.3805 2.4019 7.2175 3.6023 3.9605 3.9258 0.3362 2.8836 8.0284 7.1305 4.7750 2.2830 0.5438 1.5420 0.4163 1.0047 0.4398 3.3193 13.9127 12.5244 4.0601 16.5668 25.5987 13.1315 24.1884 1.9181 1.2914 3.0675 6.6490 8.5811 13.4759 2.0415 0.6079 1.3335 0.8343 1.4551 6.5896 2.7942 2.5896 1.0122 0.9011 556.6146 9.9821 21.0816 27.2793 18.5870 2.6356 3.4509 37.2532 13.6693 0.8112 3.3824 0.5510 3.8042 0.3115 0.2179 6.7553 5.5503 7.1447 6.3983 3.2555 5.4779 10.4038 25.7164 21.1758 20.3674 13.7535 22.5636 40.8745 18.8064 17.1948 23.4141 5.1989
temp: 298.150 k
press: 1.00000 atm
elementType: 15 6 1 1 6 1 1 6 1 1 15 6 6 6 6 1 6 1 6 1 1 1 6 6 6 6 1 6 1 6 1 1 1 6 6 6 6 1 6 1 6 1 1 1 6 6 6 6 1 6 1 6 1 1 1 46 6 6 6 6 6 6 1 1 1 1 1 6 8 17
symmnumber: 1
zpe: 1461068.6 jmol-1
zpe.correction: 0.556492 hartree
zpe.thermalcorrener: 0.593732 hartree
zpe.thermalcorrenthalpy: 0.594677 hartree
zpe.thermalcorrgfe: 0.482949 hartree
zpe.sumelectzpe: -2658.920752 hartree
zpe.sumelectthermal: -2658.883512 hartree
zpe.sumelectthermalent: -2658.882567 hartree
zpe.sumelectthermalfe: -2658.994295 hartree
dipole: 1.1012 8.8007 2.1267
dipole: 9.1208
quadrupole: -237.9661 -258.4590 -251.2890
quadrupole: -6.6103 5.1528 -4.5371
quadrupole: 11.2720 -9.2210 -2.0509 -6.6103 5.1528 -4.5371
hfenergy: -2659.4772439 hartree
pointgroup: C01 [X(C34H31Cl1O1P2Pd1)]
dipole: 0.0965959 3.4865551 0.8432838 debye
polarizability: 499.7341138|-0.3739469|460.9709203|-13.6785127|25.4759082|370.0495866 unknown
InChI: InChI=1S/C27H26P2.C7H5O.Cl.Pd/c1-5-14-24(15-6-1)28(25-16-7-2-8-17-25)22-13-23-29(26-18-9-3-10-19-26)27-20-11-4-12-21-27;8-6-7-4-2-1-3-5-7;;/h1-12,14-21H,13,22-23H2;1-5H;;
charge 0 multiplicity 1
70 atoms
P  -1.87595646 -0.13737886 -0.50669455
C  -1.83339672 0.20525143 -2.32995881
H  -1.67213798 -0.78777815 -2.76324272
H  -2.83665618 0.53166342 -2.625951
C  -0.78050413 1.18678862 -2.88023854
H  -1.05151337 1.38106625 -3.92465034
H  -0.84797191 2.15162889 -2.36715611
C  0.68037317 0.69942285 -2.87040654
H  1.29705814 1.35332345 -3.4954409
H  0.74635173 -0.31992457 -3.26391146
P  1.37188128 0.60360009 -1.15969119
C  -3.30292061 -1.26051586 -0.36271273
C  -4.56358303 -0.82719562 0.06817734
C  -3.1043337 -2.60487293 -0.71458593
C  -5.62273332 -1.73185899 0.13804228
H  -4.71654136 0.20919408 0.35079735
C  -4.17150052 -3.49832567 -0.65197672
H  -2.11930363 -2.94135935 -1.02901516
C  -5.42827947 -3.06590426 -0.22382981
H  -6.59842824 -1.3943446 0.47515901
H  -4.01510485 -4.5373328 -0.92492498
H  -6.25431401 -3.76875008 -0.16659957
C  -2.38557175 1.40361413 0.32717008
C  -2.79665694 2.55492875 -0.35435061
C  -2.31410278 1.42861665 1.72948365
C  -3.11009049 3.71769148 0.35223151
H  -2.87240082 2.55364496 -1.43575148
C  -2.6505718 2.58039039 2.43390346
H  -1.9814313 0.53938914 2.2579904
C  -3.03858444 3.7330919 1.7442579
H  -3.41263705 4.60976262 -0.18763989
H  -2.59894043 2.5853552 3.51859141
H  -3.28364085 4.63819464 2.29162044
C  3.15449679 0.24918401 -1.33994367
C  3.52663767 -1.00201696 -1.8617206
C  4.14188134 1.12197618 -0.86405594
C  4.87308552 -1.35604858 -1.9210661
H  2.75873499 -1.7035564 -2.1792065
C  5.48746366 0.75412067 -0.91790623
H  3.86190991 2.08270793 -0.4456413
C  5.85648008 -0.48198041 -1.44866104
H  5.15313372 -2.3231935 -2.32817383
H  6.24597954 1.43583913 -0.54416669
H  6.90396425 -0.76590464 -1.49032987
C  1.26002238 2.31922693 -0.53737657
C  1.5870061 3.43508271 -1.32310848
C  0.76845696 2.51757847 0.75936886
C  1.41645343 4.72401849 -0.82057044
H  1.97521199 3.29686072 -2.3278226
C  0.59850972 3.8071258 1.26247552
H  0.49862028 1.6518747 1.35580861
C  0.91833869 4.91067821 0.47174339
H  1.66794146 5.58246791 -1.43633014
H  0.19753717 3.94652891 2.26087341
H  0.7774691 5.91583584 0.8579384
Pd 0.14595675 -1.04869002 0.07557907
C  2.08782183 -2.37627856 1.27076485
C  0.94880899 -2.11133253 2.06763038
C  1.08391418 -1.37352349 3.26466798
C  2.33550906 -0.93062168 3.66334127
C  3.46148468 -1.17019292 2.85745339
C  3.33957402 -1.88712167 1.67402162
H  1.98631946 -2.97231303 0.36873748
H  2.44396879 -0.38478161 4.59584884
H  4.4319536 -0.79194245 3.16394496
H  4.204385 -2.06114151 1.04257906
H  0.20002017 -1.16645806 3.86022052
C  -0.42531809 -2.32011654 1.49454315
O  -1.38748894 -2.91002081 1.88585773
Cl 0.47757458 -2.81387746 -1.8753673
