program: Gaussian 16
title: Title Card Required
version: ES64L-G16RevA.03
method: RB3LYP
basis: GenECP
operation: Freq
keyword: #N
keyword: Geom=AllCheck
keyword: Guess=TCheck
keyword: SCRF=Check
keyword: GenChk
keyword: RB3LYP/GenECP
keyword: Freq
converged: YES YES YES YES
title: Mulliken charges:
elementType: P C H H C H H C H H P C C C C H C H C H H H C C C C H C H C H H H C C C C H C H C H H H C C C C H C H C H H H Pd C C C C C C H H H H H Cl
charge: 0.687203 -0.390414 0.132249 0.133411 -0.199779 0.110540 0.145411 -0.394777 0.131983 0.136153 0.634118 -0.140837 -0.092979 -0.096686 -0.083970 0.101056 -0.078033 0.154181 -0.086638 0.094526 0.105892 0.095793 -0.111223 -0.106932 -0.081093 -0.078225 0.087885 -0.068758 0.108547 -0.082267 0.090472 0.093585 0.091502 -0.127925 -0.099812 -0.099079 -0.087915 0.159921 -0.083930 0.083300 -0.088754 0.101149 0.087662 0.090859 -0.101814 -0.088996 -0.089686 -0.085570 0.088027 -0.082230 0.157057 -0.083468 0.088183 0.097389 0.090617 -0.516990 -0.103638 -0.031844 -0.092746 -0.071805 -0.100503 -0.061022 0.079055 0.067000 0.067874 0.066775 0.082033 -0.351072
chargesum: -0.00000
title: Mulliken charges with hydrogens summed into heavy atoms:
elementType: P C C C P C C C C C C C C C C C C C C C C C C C C C C C C Pd C C C C C C Cl
charge: 0.687203 -0.124754 0.056171 -0.126641 0.634118 -0.140837 0.008077 0.057495 0.010556 0.027860 0.009156 -0.111223 -0.019047 0.027455 0.012248 0.024827 0.009235 -0.127925 0.060109 -0.015779 0.013234 0.003732 0.002105 -0.101814 -0.000969 0.067371 0.002613 0.015158 0.007149 -0.516990 -0.024583 -0.031844 -0.010713 -0.004805 -0.032628 0.005753 -0.351072
chargesum: 0.00000
1716.lowfreq: -4.1893 -0.0027 -0.0026 -0.0026 3.1879 8.0653 15.2138 24.0991 30.0863
frequency: 14.9987 23.8603 30.0443 35.0676 36.2182 42.8138 46.6433 48.4926 51.0274 62.5877 66.8514 71.9800 79.2307 87.2722 95.2817 114.6046 121.6845 124.3042 139.0855 166.2044 174.1097 191.1870 200.6034 205.6568 216.3533 225.4047 234.6128 240.9572 252.8624 263.0079 263.5337 280.9643 297.0828 304.4435 338.8337 358.0449 399.3235 407.1373 408.7749 410.0812 417.1656 429.2013 433.9680 450.3987 461.9288 478.8773 486.6883 489.7855 493.3398 529.0609 543.0538 629.1499 632.2388 632.5332 632.7709 633.7137 666.6485 673.8400 693.9684 703.3149 706.3189 706.5380 710.1974 711.7748 717.8849 718.7612 722.2925 724.5429 743.1822 754.1428 757.2452 762.4804 768.7032 795.8345 840.5125 852.2868 855.9843 861.0671 868.6076 873.1473 899.3725 925.3417 938.2801 941.6644 946.0265 946.9709 958.7305 972.1419 980.4590 981.6366 990.3402 991.5926 992.0838 998.7719 1004.3441 1013.0506 1015.5852 1018.9250 1020.4693 1021.1314 1021.2666 1022.8600 1046.1817 1054.4474 1054.9200 1056.3195 1058.4906 1073.7125 1089.8246 1096.4437 1110.1465 1111.2940 1113.2895 1116.8095 1125.6518 1126.2358 1129.5595 1129.8531 1142.6969 1182.0724 1187.6939 1189.8740 1189.9433 1190.7078 1191.9605 1203.7850 1214.7396 1215.6975 1222.3348 1223.1939 1267.2128 1292.7954 1324.2449 1327.5648 1331.5404 1334.9719 1335.0015 1337.2705 1348.7759 1363.4603 1365.8055 1369.1011 1372.9148 1390.6260 1465.9652 1470.1550 1477.1838 1478.2273 1479.2963 1481.7050 1483.8583 1510.3635 1511.5329 1526.1874 1527.7767 1531.4618 1531.6649 1624.3970 1628.2121 1628.9504 1629.7991 1631.8557 1634.2509 1647.0578 1647.7981 1648.7419 1651.2312 3047.0917 3064.6889 3068.7596 3088.4665 3121.6858 3133.1276 3162.5769 3168.7791 3174.8779 3178.5110 3180.2224 3182.1633 3183.5982 3184.2050 3185.7282 3188.3208 3192.1556 3192.4762 3195.3010 3197.4097 3199.3087 3202.0502 3202.7403 3205.7680 3208.7612 3209.2046 3211.5173 3212.4370 3217.5746 3220.3468 3222.9527
redmass: 5.4226 6.0452 5.0198 4.4675 5.1287 4.1051 4.7019 5.1952 4.8096 4.3201 4.5274 4.4597 5.2430 7.4490 6.8130 9.5967 7.7025 7.1151 4.0435 5.7234 3.8776 5.9133 4.2965 4.8807 4.1651 5.4252 5.8118 3.5127 3.8838 5.8142 6.6327 4.6327 3.2817 16.3694 5.1875 4.0757 2.8700 2.9172 2.9595 2.9158 2.9887 3.1372 5.6391 6.5263 6.6490 3.4772 3.6219 4.0421 3.8776 4.8969 5.0510 6.4076 6.3399 6.2985 6.3562 6.4052 4.7994 5.1892 5.0322 2.0849 2.1104 2.2575 3.1862 2.8358 2.8134 3.8196 3.7476 5.9614 1.8207 1.6812 1.5229 1.5834 1.7103 1.6523 1.2615 1.3833 1.8889 1.2500 1.2436 1.2452 1.3667 1.3301 1.3541 1.7132 1.3584 1.3405 1.3742 1.3657 1.3700 1.2458 1.6648 1.3363 1.4428 1.2825 1.3333 1.6760 2.9418 5.6463 5.9400 4.7943 5.0011 1.3881 4.1037 2.7429 2.7948 2.8286 2.8115 2.3370 2.0793 1.6685 1.6391 1.6596 1.6641 1.5910 2.6467 2.8474 2.8978 2.9400 1.1391 1.0912 1.1771 1.0986 1.0998 1.1099 1.0987 1.1369 1.1408 1.1441 1.1457 1.1522 1.2523 1.4052 2.4573 1.9318 2.2689 2.5642 1.9743 2.6270 2.0619 2.0687 1.8985 1.8061 1.5932 1.3656 1.0966 2.0829 2.1296 2.1178 2.0454 2.1466 1.1515 1.0871 2.0578 2.0597 2.0459 1.9943 2.0280 5.4035 5.4115 5.3298 5.2619 5.3239 5.3136 5.3666 5.4699 5.2815 5.4434 1.0610 1.0660 1.0636 1.0956 1.1056 1.0999 1.0834 1.0859 1.0918 1.0858 1.0901 1.0862 1.0853 1.0863 1.0939 1.0882 1.0886 1.0880 1.0901 1.0981 1.0922 1.0920 1.0913 1.0936 1.0960 1.0939 1.0960 1.0966 1.0973 1.0950 1.0946
irintensity: 0.0555 0.1930 0.0130 0.2193 0.3377 0.1504 0.3123 0.4999 0.0765 0.0251 0.4051 0.4870 0.6788 2.7074 2.4603 2.4602 0.0850 0.1537 0.1666 0.1319 0.7288 0.4919 0.5444 4.4331 4.8406 2.2231 3.1856 0.5437 0.1647 1.3577 6.8588 1.2180 0.0538 26.5559 4.0552 1.8683 0.0165 0.1646 0.1025 0.2337 0.0190 8.0999 9.9850 2.5257 28.2776 7.7188 6.9471 14.5029 21.2187 88.9051 29.6564 0.0422 0.9892 0.9784 0.8626 0.0981 37.5774 9.5527 2.9697 37.8790 12.6940 16.7496 3.7639 15.5790 14.7788 33.7657 10.0779 7.4643 53.2630 4.5762 24.9983 15.7870 8.8844 20.6954 0.8894 11.3406 21.6697 0.0496 1.1315 1.9063 5.3444 0.5927 1.4799 6.5601 0.7204 2.8959 0.2026 0.1973 0.3682 0.5419 22.5850 1.2357 8.5519 0.6712 0.0515 3.3510 17.1524 1.3500 4.7482 1.9358 0.1681 0.6707 10.5111 0.5487 1.3759 0.6205 0.3890 4.7751 7.8693 3.2961 0.4011 0.4959 0.8681 0.6055 9.3032 52.1448 24.9867 4.6272 13.8359 0.0111 17.9428 0.1850 0.4463 2.7482 1.3976 0.0522 5.0221 7.5780 0.4894 6.5352 4.8117 2.5324 0.7825 2.9600 3.0737 8.1198 1.8366 2.3240 0.1140 2.5690 1.5290 1.4739 2.0576 2.5054 1.5054 2.7345 22.7358 14.4904 9.5732 14.6217 9.6839 6.5513 16.7131 4.6675 6.0100 6.9354 9.5277 39.2404 8.1613 2.6754 1.8204 2.0662 0.2264 0.1895 0.5850 0.3811 1.1068 22.0500 4.7629 6.7771 30.1548 12.7562 7.0541 4.8051 2.0521 26.7279 1.3335 2.4134 1.1595 3.1295 4.7486 38.8301 2.8008 4.9347 3.8982 4.4147 50.1388 20.7642 18.6493 11.8825 26.3119 27.6281 12.1977 26.9802 22.0326 11.2851 11.4283 4.8495
temp: 298.150 k
press: 1.00000 atm
elementType: 15 6 1 1 6 1 1 6 1 1 15 6 6 6 6 1 6 1 6 1 1 1 6 6 6 6 1 6 1 6 1 1 1 6 6 6 6 1 6 1 6 1 1 1 6 6 6 6 1 6 1 6 1 1 1 46 6 6 6 6 6 6 1 1 1 1 1 17
symmnumber: 1
zpe: 1436446.3 jmol-1
zpe.correction: 0.547114 hartree
zpe.thermalcorrener: 0.582147 hartree
zpe.thermalcorrenthalpy: 0.583091 hartree
zpe.thermalcorrgfe: 0.476937 hartree
zpe.sumelectzpe: -2545.596756 hartree
zpe.sumelectthermal: -2545.561723 hartree
zpe.sumelectthermalent: -2545.560778 hartree
zpe.sumelectthermalfe: -2545.666933 hartree
dipole: 0.0654 6.3654 -7.4681
dipole: 9.8130
quadrupole: -225.7609 -235.8347 -249.0492
quadrupole: -3.9314 0.6680 18.0425
quadrupole: 11.1207 1.0469 -12.1676 -3.9314 0.6680 18.0425
hfenergy: -2546.1438691 hartree
pointgroup: C01 [X(C33H31Cl1P2Pd1)]
dipole: 0.2909738 1.8889152 -3.3545056 debye
polarizability: 491.3584136|-27.8132908|442.8659688|24.5156134|4.6402031|344.0197146 unknown
InChI: InChI=1S/C27H26P2.C6H5.ClH.Pd/c1-5-14-24(15-6-1)28(25-16-7-2-8-17-25)22-13-23-29(26-18-9-3-10-19-26)27-20-11-4-12-21-27;1-2-4-6-5-3-1;;/h1-12,14-21H,13,22-23H2;1-5H;1H;/q;;;+1/p-1
charge 0 multiplicity 1
68 atoms
P  1.25510947 0.14345549 -1.03310469
C  0.6739558 -0.2607136 -2.7611802
H  0.92152632 0.6011545 -3.38915005
H  1.2776603 -1.09726012 -3.1199142
C  -0.81424034 -0.61023996 -2.90386795
H  -1.03205578 -0.70600132 -3.97327645
H  -1.00080481 -1.59735606 -2.46430126
C  -1.76508113 0.42620905 -2.27643606
H  -2.72346313 0.44372531 -2.80247269
H  -1.33162534 1.42928409 -2.33722917
P  -2.04926472 0.01170938 -0.48739215
C  1.21436716 1.97535861 -0.98305096
C  1.85960082 2.75061494 -1.95953206
C  0.48964239 2.61465523 0.0305207
C  1.75790883 4.13946862 -1.93148402
H  2.45173188 2.26927587 -2.73261091
C  0.3771916 4.00549015 0.0502391
H  0.00511597 2.01666088 0.79377333
C  1.0084272 4.76770801 -0.93166278
H  2.26072587 4.73328313 -2.68885319
H  -0.21044664 4.48252505 0.82793638
H  0.92278921 5.85013711 -0.9195525
C  3.03040609 -0.28182289 -1.06982384
C  3.46232178 -1.49171355 -1.62913048
C  3.95118801 0.52199912 -0.38484759
C  4.79664787 -1.87956785 -1.52663168
H  2.75826342 -2.15408426 -2.12271953
C  5.28161905 0.12541142 -0.27337706
H  3.62250425 1.44415955 0.07965968
C  5.70894474 -1.07237806 -0.84711236
H  5.1191099 -2.81890422 -1.96533758
H  5.9822851 0.74944514 0.27219016
H  6.74584345 -1.38073947 -0.755603
C  -2.75315779 1.54501148 0.22149547
C  -2.73842289 1.68581406 1.61922701
C  -3.23077992 2.59796225 -0.570885
C  -3.19048396 2.86708735 2.2052401
H  -2.35987285 0.87204544 2.23271595
C  -3.67973693 3.77881878 0.02170505
H  -3.24654355 2.51081602 -1.65189811
C  -3.65668483 3.91685495 1.40986304
H  -3.17236718 2.96847133 3.28618123
H  -4.04261276 4.59049543 -0.60193596
H  -4.00139969 4.83813432 1.87020383
C  -3.43013817 -1.1819269 -0.5813503
C  -4.68201444 -0.80663694 -1.09074287
C  -3.21695446 -2.50063473 -0.16259586
C  -5.70428759 -1.74624502 -1.19629544
H  -4.86119785 0.2228871 -1.38842176
C  -4.24380015 -3.44023898 -0.27391859
H  -2.26515293 -2.76970726 0.28164767
C  -5.48326791 -3.06613681 -0.79170482
H  -6.67360351 -1.45083792 -1.58687637
H  -4.07586116 -4.46039138 0.05730072
H  -6.28220063 -3.79742209 -0.87172771
Pd -0.03709913 -0.6615254 0.66271911
C  2.45313279 -2.12862141 1.53786193
C  1.69241027 -0.96648215 1.68482178
C  2.15625834 0.04612383 2.53062631
C  3.37053476 -0.09652297 3.20899136
C  4.13122825 -1.25517699 3.05004588
C  3.66546532 -2.2736113 2.21681645
H  2.11459978 -2.92303839 0.87865598
H  3.71954142 0.69955597 3.86231213
H  5.07801203 -1.36478175 3.57140513
H  4.24993777 -3.18098162 2.08752367
H  1.57424352 0.95323029 2.66880974
Cl -1.26687153 -1.45064391 2.56525332
