program: Gaussian 16
title: Title Card Required
version: ES64L-G16RevA.03
method: RB3LYP
basis: GenECP
operation: Freq
keyword: #N
keyword: Geom=AllCheck
keyword: Guess=TCheck
keyword: SCRF=Check
keyword: GenChk
keyword: RB3LYP/GenECP
keyword: Freq
converged: YES YES NO YES
title: Mulliken charges:
elementType: P C H H C H H C H H P Pd C C C C H C H C H H H C C C C H C H C H H H C C C C H C H C H H H C C C C H C H C H H H C C C C H C H C H H H Br
charge: 0.529001 -0.369197 0.134664 0.115544 -0.207876 0.102125 0.125716 -0.366327 0.117403 0.128515 0.565835 -0.439884 -0.104906 -0.091850 -0.111526 -0.083227 0.086409 -0.082283 0.127027 -0.087069 0.085219 0.090343 0.086923 -0.098649 -0.103317 -0.113497 -0.077301 0.083265 -0.082134 0.128607 -0.091269 0.086750 0.088060 0.087316 -0.105187 -0.118666 -0.107639 -0.076165 0.084020 -0.078332 0.100176 -0.089578 0.085902 0.087726 0.087137 -0.121377 -0.091621 -0.106488 -0.083072 0.092918 -0.077159 0.140396 -0.090251 0.085299 0.089087 0.085348 -0.033655 -0.037414 -0.141018 -0.111444 0.111010 -0.026029 0.140991 -0.090997 0.083394 0.089975 0.080462 -0.116156
chargesum: -0.00000
title: Mulliken charges with hydrogens summed into heavy atoms:
elementType: P C C C P Pd C C C C C C C C C C C C C C C C C C C C C C C C C C C C C C Br
charge: 0.529001 -0.118989 0.019966 -0.120409 0.565835 -0.439884 -0.104906 -0.005441 0.015501 0.001992 0.008059 -0.000146 -0.098649 -0.020052 0.015110 0.009449 0.005926 -0.003952 -0.105187 -0.034646 -0.007463 0.009737 0.009394 -0.002441 -0.121377 0.001297 0.033907 0.002226 0.011927 -0.004903 -0.033655 0.073596 -0.000027 -0.028050 0.063946 -0.010535 -0.116156
1716.lowfreq: -8.4262 -5.0337 -0.0037 -0.0009 0.0078 7.0473 13.6107 15.6699 25.0664
frequency: 13.4049 14.1143 24.6977 25.6390 29.2331 35.3949 39.9492 44.8065 46.5564 51.5244 60.1842 63.6883 65.5700 78.1470 93.2805 98.2153 110.6655 127.5693 134.8853 141.7531 169.9043 182.8317 190.9899 198.0415 202.7429 222.1415 225.6903 257.0337 260.0698 263.8764 271.8917 291.1076 300.4667 342.2965 361.5460 376.9823 405.5387 409.4005 410.8729 411.1340 415.9135 424.9314 432.9154 441.8023 452.1355 473.6516 486.2455 500.2228 516.8340 523.1928 532.9167 618.7017 631.8024 633.3376 633.6102 634.0226 651.5455 655.3202 680.6186 684.4354 707.7484 709.4021 710.6891 713.2304 714.4697 716.0104 718.6111 721.8329 735.4610 754.9210 759.5656 764.3993 767.9680 811.8505 813.5394 843.7121 859.8224 866.9061 867.4302 869.0542 870.3792 922.7168 926.9237 936.3303 939.8991 942.5185 944.6120 969.6967 974.3223 984.6274 985.5311 988.6050 992.1610 996.1137 998.9535 1003.4018 1006.6708 1009.8471 1012.2079 1018.8157 1020.0891 1020.3839 1020.9787 1039.5016 1052.8856 1053.9595 1055.2053 1055.9155 1062.9327 1083.2853 1106.7761 1108.3685 1110.6409 1113.0984 1120.2320 1120.5840 1124.2605 1125.3948 1129.4727 1184.1927 1187.1356 1187.8834 1188.5212 1188.9538 1192.6284 1194.0894 1209.8446 1213.4281 1217.4975 1219.8086 1256.7153 1295.5250 1313.3358 1326.3063 1330.2892 1332.5194 1333.8663 1338.4408 1359.7746 1363.5298 1366.5063 1366.9830 1368.4515 1386.0707 1451.9658 1464.6998 1475.8018 1476.8130 1478.0386 1479.2879 1479.9255 1486.8320 1509.2501 1523.7536 1526.8915 1528.1590 1530.0743 1572.6643 1627.4581 1628.0284 1629.6171 1630.3763 1631.0367 1645.9639 1646.4527 1647.8406 1648.2843 3035.1029 3042.0269 3049.6462 3085.5326 3090.9176 3099.2711 3177.6473 3177.6841 3177.9456 3180.2438 3181.1678 3184.7349 3186.3372 3187.4772 3188.8421 3189.8155 3194.5457 3194.6415 3197.7892 3198.2464 3202.5314 3204.6012 3205.3563 3205.9420 3206.7223 3208.7926 3211.3747 3212.8841 3216.7357 3218.0674 3222.3771
redmass: 6.6831 5.8889 4.1759 5.2359 4.3607 5.5741 5.2411 5.0278 5.7744 6.3930 7.4457 4.7204 6.7831 4.8008 6.2580 5.6370 6.5046 5.6476 4.6374 5.9151 5.4981 6.7463 5.1339 4.3244 3.4208 3.7295 4.6978 4.1564 4.3690 4.7066 4.0579 4.2588 9.8312 4.2841 4.0187 3.7253 2.9183 3.0246 3.0831 3.5271 2.9941 3.4738 6.2865 4.2835 7.0087 3.8441 3.7235 3.9503 4.4895 4.3990 4.5420 6.1860 5.8556 6.3962 6.3627 6.4028 4.2991 5.9328 4.4601 4.7147 4.2035 3.1652 2.6585 2.4336 2.6702 2.3973 5.3807 4.0867 1.2641 1.5923 1.5809 1.6963 1.7216 1.2828 1.4730 2.2011 1.2888 1.2514 1.2656 1.2551 1.2473 1.3728 1.7182 1.3385 1.3370 1.3655 1.3513 1.2783 1.3607 1.3562 1.3549 1.3409 1.9173 4.1192 1.2636 1.2671 1.2842 6.2095 1.3298 6.1348 5.6163 5.9994 6.1515 1.9017 2.7525 2.8513 2.7769 2.8616 2.1698 1.6483 1.5939 1.6289 1.6451 1.6404 2.4978 2.9048 2.7127 1.8655 1.7190 1.0810 1.0992 1.0988 1.0956 1.0961 1.1449 1.1504 1.1387 1.1429 1.1463 1.1461 1.2388 1.4462 1.5709 2.4612 2.6078 2.5100 2.4774 1.3309 2.2293 1.9444 1.8099 1.8516 4.0604 1.3724 2.0004 1.0983 1.8648 1.9187 2.1068 2.0636 1.3278 1.9712 1.0797 2.0727 2.0499 2.0244 2.0173 5.0895 5.1902 5.0249 5.1934 5.3830 5.3086 5.4154 5.4886 5.4009 5.3827 1.0632 1.0602 1.0612 1.1015 1.1041 1.1001 1.0853 1.0853 1.0848 1.0848 1.0846 1.0870 1.0875 1.0886 1.0879 1.0887 1.0919 1.0918 1.0919 1.0921 1.0935 1.0944 1.0942 1.0939 1.0945 1.0980 1.0964 1.0959 1.0950 1.0943 1.0931
irintensity: 0.0291 0.0798 0.0501 0.1498 0.0999 0.0731 0.0327 0.0114 0.0381 0.1518 0.1412 0.4176 0.4967 0.5818 0.2546 0.8936 0.2500 0.6845 0.0938 0.1455 0.7251 1.1854 1.3502 2.3405 1.7847 0.8661 0.5225 1.2547 0.2366 0.2051 2.4086 1.1009 6.6180 5.4633 6.3117 5.6775 0.9586 6.5671 2.4667 9.6494 2.3255 11.2709 26.5401 4.4051 12.0418 7.5987 29.8643 52.9231 15.2489 98.5363 0.1539 6.9188 5.4755 0.2875 0.4432 0.0911 36.6612 16.3556 8.4723 1.0169 1.8610 9.5183 16.1161 12.5021 47.4578 30.8781 6.6270 8.2350 106.2938 19.7127 9.9193 7.2165 18.0983 19.7845 18.2307 18.8529 5.6852 1.2090 4.1848 2.7789 1.1162 1.2863 8.2190 0.8185 1.3462 7.2101 0.4420 1.4016 1.0630 0.3201 1.1986 0.3848 32.2552 2.2533 0.1721 0.3180 2.3347 29.5197 1.1461 0.8250 2.5577 0.6714 2.3322 1.4678 1.7558 0.9509 0.1055 1.8969 6.7063 5.4759 0.5752 0.1912 1.4560 0.5585 8.1954 30.2528 7.3145 11.2587 1.1798 0.9349 0.3705 0.1162 0.6965 0.5819 4.3639 14.2505 3.8870 3.1275 0.4066 0.5309 1.2100 4.7387 4.9035 5.7572 11.8448 6.2988 1.0226 3.8063 0.3622 0.7309 0.7114 1.0562 7.3220 6.6057 11.8844 5.5479 16.2865 12.8217 19.1168 10.0677 12.6036 12.1588 2.1946 6.0574 4.6950 12.3386 4.7254 21.1684 2.1167 4.8327 0.4126 0.9031 2.0087 0.4324 1.3826 3.1025 11.5892 6.9740 21.5618 40.0051 18.5959 8.5964 20.9315 1.7064 2.9819 0.4450 0.2608 0.1287 1.0497 3.3808 5.1744 10.6511 15.1343 15.4574 22.9016 12.6256 15.3277 7.6052 8.0837 28.1142 29.8024 24.8174 41.5529 23.4733 23.3232 6.0690 9.2309 1.7310
temp: 298.150 k
press: 1.00000 atm
elementType: 15 6 1 1 6 1 1 6 1 1 15 46 6 6 6 6 1 6 1 6 1 1 1 6 6 6 6 1 6 1 6 1 1 1 6 6 6 6 1 6 1 6 1 1 1 6 6 6 6 1 6 1 6 1 1 1 6 6 6 6 1 6 1 6 1 1 1 35
symmnumber: 1
zpe: 1432106.0 jmol-1
zpe.correction: 0.545460 hartree
zpe.thermalcorrener: 0.580830 hartree
zpe.thermalcorrenthalpy: 0.581774 hartree
zpe.thermalcorrgfe: 0.472501 hartree
zpe.sumelectzpe: -4656.778679 hartree
zpe.sumelectthermal: -4656.743309 hartree
zpe.sumelectthermalent: -4656.742365 hartree
zpe.sumelectthermalfe: -4656.851638 hartree
dipole: 1.0569 3.9178 -1.2108
dipole: 4.2347
quadrupole: -237.9459 -249.5191 -242.0974
quadrupole: -4.6203 -0.8746 3.5441
quadrupole: 5.2416 -6.3316 1.0900 -4.6203 -0.8746 3.5441
hfenergy: -4657.3241395 hartree
pointgroup: C01 [X(C33H31Br1P2Pd1)]
dipole: -0.3650804 1.5429574 0.511608 debye
polarizability: 495.0173424|5.3544519|438.3737516|7.5393153|-20.6515071|385.6896484 unknown
InChI: InChI=1S/C27H26P2.C6H5Br.Pd/c1-5-14-24(15-6-1)28(25-16-7-2-8-17-25)22-13-23-29(26-18-9-3-10-19-26)27-20-11-4-12-21-27;7-6-4-2-1-3-5-6;/h1-12,14-21H,13,22-23H2;1-5H;
charge 0 multiplicity 1
68 atoms
P  1.56762519 0.41288214 1.28304326
C  0.73122977 0.98433035 2.84617936
H  0.63926393 0.08561179 3.46710748
H  1.39770908 1.66339777 3.39056547
C  -0.65067627 1.6439403 2.66839505
H  -0.89229218 2.14555464 3.61310199
H  -0.59725923 2.43719074 1.91502923
C  -1.82730828 0.70480149 2.33842943
H  -2.76676082 1.21253592 2.58493913
H  -1.76765378 -0.19957359 2.95461354
P  -1.87607775 0.16512618 0.55672153
Pd 0.13759755 -0.82743031 -0.08733254
C  3.19438683 -0.13865633 1.94389677
C  4.12236721 0.75105308 2.50482558
C  3.50518534 -1.50251137 1.87717417
C  5.33694001 0.28078904 3.00035155
H  3.90171686 1.81418555 2.53615749
C  4.72113139 -1.97265705 2.37710421
H  2.79797237 -2.18840721 1.42106212
C  5.63675776 -1.0831015 2.93945687
H  6.05275916 0.9764447 3.4289703
H  4.95372047 -3.03195693 2.31898587
H  6.58530754 -1.44747096 3.32308752
C  1.99931325 1.98176332 0.42354071
C  1.90471818 3.25607642 0.99656524
C  2.38243367 1.87373413 -0.92382413
C  2.17442606 4.39797098 0.23891285
H  1.60902474 3.37119808 2.03360452
C  2.66430918 3.01176993 -1.67557324
H  2.42898934 0.89206028 -1.38577013
C  2.55368081 4.27972518 -1.09757111
H  2.08374786 5.37969512 0.69457002
H  2.95647786 2.91000473 -2.71677391
H  2.75938772 5.16870254 -1.68642603
C  -3.51300649 -0.65048605 0.40493164
C  -4.3244078 -0.99566887 1.49357451
C  -3.93082404 -1.00918745 -0.88869813
C  -5.52845068 -1.67585843 1.29287006
H  -4.02570655 -0.73835045 2.5039196
C  -5.13553903 -1.67545848 -1.08843577
H  -3.30228373 -0.75745659 -1.73881984
C  -5.93914972 -2.01407204 0.00480814
H  -6.14588522 -1.93766766 2.14735251
H  -5.44755616 -1.9375875 -2.09523812
H  -6.87557069 -2.54164003 -0.14905319
C  -2.17269173 1.77525048 -0.28254702
C  -3.34603924 2.51806555 -0.0833631
C  -1.16225079 2.29887906 -1.09908174
C  -3.494545 3.77008962 -0.6769239
H  -4.14529866 2.1105027 0.52951065
C  -1.3061826 3.55779541 -1.68416721
H  -0.26436672 1.71560108 -1.26765047
C  -2.47099428 4.29499197 -1.47211255
H  -4.40655112 4.33879271 -0.51936777
H  -0.50375044 3.95721896 -2.29662074
H  -2.58702829 5.27443366 -1.92718056
C  1.13543007 -2.36717707 -1.48827232
C  2.25744953 -1.83021833 -2.17133033
C  -0.19134524 -2.1131873 -1.94392673
C  2.05988237 -0.98359601 -3.24289279
H  3.25441874 -2.0861825 -1.83113644
C  -0.34435271 -1.24259689 -3.06247137
H  -1.01586516 -2.74087281 -1.62741296
C  0.74881301 -0.67941989 -3.68625156
H  2.91817806 -0.55427121 -3.75101226
H  -1.34708778 -1.04907279 -3.43211085
H  0.60791796 -0.02186338 -4.53840888
Br 1.42462429 -3.91508665 -0.34808367
