program: Gaussian 16
title: Title Card Required
version: ES64L-G16RevA.03
method: RB3LYP
basis: GenECP
operation: Freq
keyword: #N
keyword: Geom=AllCheck
keyword: Guess=TCheck
keyword: SCRF=Check
keyword: GenChk
keyword: RB3LYP/GenECPFreq
converged: YES YES NO YES
title: Mulliken charges:
elementType: P C H H C H H C H H P C C C C H C H C H H H C C C C H C H C H H H C C C C H C H C H H H C C C C H C H C H H H Pd C C C C C C H H H H I H Cu C C N N C C C H H H H H H H H C O B C O O C C C C C C C C H H H H H C H H H C H H H C H H H C H H H C H H C O H
charge: 0.681516 -0.387215 0.169336 0.114341 -0.211430 0.106321 0.124256 -0.383106 0.136630 0.153437 0.631873 -0.130951 -0.080363 -0.091818 -0.086442 0.133073 -0.079067 0.091354 -0.084883 0.090989 0.081712 0.083452 -0.121908 -0.092306 -0.100747 -0.083490 0.091555 -0.072586 0.142403 -0.088604 0.086762 0.092524 0.088027 -0.106672 -0.101640 -0.105319 -0.075766 0.107873 -0.080646 0.101408 -0.085629 0.112546 0.084934 0.086654 -0.115300 -0.094072 -0.120089 -0.079564 0.089359 -0.088867 0.166956 -0.084472 0.090745 0.099247 0.091895 -0.553780 -0.084193 0.077433 -0.086728 -0.094742 -0.082134 -0.086746 0.105974 0.101988 0.084743 0.080650 -0.197420 0.146140 -0.025485 -0.181845 0.274367 -0.392513 -0.367766 0.033191 0.033757 -0.201364 0.121098 0.122754 0.099477 0.163441 0.188664 0.129747 0.124656 0.183684 0.257788 -0.392637 0.639080 0.000490 -0.479746 -0.479152 0.249994 0.250648 0.119733 -0.158896 -0.095627 -0.098777 -0.134105 -0.098164 0.072674 0.069267 0.068950 0.065587 0.060200 -0.328397 0.091343 0.116240 0.129693 -0.318011 0.111505 0.095262 0.114613 -0.333150 0.106068 0.098840 0.111807 -0.311517 0.093281 0.114879 0.118224 -0.429405 0.109157 0.158797 0.157100 -0.574351 0.035441
chargesum: -0.00000
title: Mulliken charges with hydrogens summed into heavy atoms:
elementType: P C C C P C C C C C C C C C C C C C C C C C C C C C C C C Pd C C C C C C I Cu C C N N C C C C O B C O O C C C C C C C C C C C C C C O
charge: 0.681516 -0.103538 0.019146 -0.093039 0.631873 -0.130951 0.052710 -0.000464 0.004546 0.002645 -0.001432 -0.121908 -0.000751 0.041656 0.003272 0.019938 -0.000578 -0.106672 0.006233 -0.003910 0.036780 0.004288 0.001025 -0.115300 -0.004713 0.046867 0.011180 0.010379 0.007423 -0.553780 0.021781 0.077433 0.059412 0.007246 0.002609 -0.006096 -0.197420 -0.025485 0.256243 0.274367 -0.392513 -0.367766 0.154289 0.156511 0.250218 0.257788 -0.392637 0.639080 0.000490 -0.479746 -0.479152 0.249994 0.250648 0.119733 -0.086223 -0.026677 -0.033190 -0.073905 -0.028897 0.008879 0.003370 -0.016435 0.014867 -0.161450 0.192541 -0.574351
chargesum: -0.00005
1716.lowfreq: -0.0035 -0.0025 -0.0015 1.7167 2.9898 4.8697 16.6484 20.1991 24.1496
temp: 298.150 k
press: 1.00000 atm
elementType: 15 6 1 1 6 1 1 6 1 1 15 6 6 6 6 1 6 1 6 1 1 1 6 6 6 6 1 6 1 6 1 1 1 6 6 6 6 1 6 1 6 1 1 1 6 6 6 6 1 6 1 6 1 1 1 46 6 6 6 6 6 6 1 1 1 1 53 1 29 6 6 7 7 6 6 6 1 1 1 1 1 1 1 1 6 8 5 6 8 8 6 6 6 6 6 6 6 6 1 1 1 1 1 6 1 1 1 6 1 1 1 6 1 1 1 6 1 1 1 6 1 1 6 8 1
symmnumber: 1
zpe: 2671221.7 jmol-1
zpe.correction: 1.017415 hartree
zpe.thermalcorrener: 1.084354 hartree
zpe.thermalcorrenthalpy: 1.085299 hartree
zpe.thermalcorrgfe: 0.910959 hartree
zpe.sumelectzpe: -3545.205387 hartree
zpe.sumelectthermal: -3545.138448 hartree
zpe.sumelectthermalent: -3545.137503 hartree
zpe.sumelectthermalfe: -3545.311843 hartree
dipole: 0.8363 -5.9063 -5.4651
dipole: 8.0902
quadrupole: -366.4198 -402.1738 -435.8544
quadrupole: -25.4745 12.7649 7.8696
quadrupole: 35.0629 -0.6911 -34.3717 -25.4745 12.7649 7.8696
hfenergy: -3546.222802 hartree
pointgroup: C01 [X(C54H59B1Cu1I1N2O4P2Pd1)]
dipole: -1.0652739 2.1989439 2.0398253 debye
polarizability: 826.7554161|-2.2598251|801.1059286|40.7520822|13.4260934|564.8307316 unknown
InChI: InChI=1S/C27H26P2.C15H20BO3.C7H5O.C5H8N2.Cu.I.Pd/c1-5-14-24(15-6-1)28(25-16-7-2-8-17-25)22-13-23-29(26-18-9-3-10-19-26)27-20-11-4-12-21-27;1-14(2)15(3,4)19-16(18-14)10-13(11-17)12-8-6-5-7-9-12;8-6-7-4-2-1-3-5-7;1-6-3-4-7(2)5-6;;;/h1-12,14-21H,13,22-23H2;5-9,11H,10H2,1-4H3;1-5H;3-4H,1-2H3;;;/q;-1;;;+1;;
charge 0 multiplicity 1
125 atoms
P  -2.52222239 1.46652278 0.90092187
C  -2.52420651 1.07461828 2.70659935
H  -1.46896088 1.08988763 2.99435218
H  -3.05666642 1.86645856 3.24304917
C  -3.16264111 -0.27760715 3.04490049
H  -3.2839187 -0.32336243 4.1335982
H  -4.17351468 -0.32816478 2.62637748
C  -2.34356636 -1.50839597 2.62782456
H  -2.67649944 -2.39468653 3.17765015
H  -1.29003337 -1.36038214 2.8798034
P  -2.35330001 -1.94868866 0.82992007
C  -1.99844307 3.22453147 0.86385518
C  -2.06572035 3.90790642 -0.3618292
C  -1.54583084 3.91131926 1.99845621
C  -1.69418772 5.24715699 -0.44440014
H  -2.39828693 3.3833961 -1.25016079
C  -1.17618287 5.2537768 1.91219377
H  -1.46562276 3.40210005 2.95049983
C  -1.24601374 5.9240702 0.69237386
H  -1.75264257 5.76107644 -1.3992788
H  -0.82088299 5.77153366 2.79787735
H  -0.95111262 6.96706674 0.62695637
C  -4.31608659 1.59886572 0.52718727
C  -5.17256979 2.42157019 1.2747275
C  -4.8471113 0.82075029 -0.50724482
C  -6.53829759 2.44536497 1.00285383
H  -4.76834871 3.05081434 2.06279036
C  -6.21651758 0.83994752 -0.7767223
H  -4.18122157 0.19434043 -1.09087676
C  -7.06276668 1.64859469 -0.01994698
H  -7.19545414 3.0840412 1.58590033
H  -6.61616175 0.21503647 -1.56877499
H  -8.12900652 1.66423546 -0.22593499
C  -1.44341035 -3.53193334 0.84876134
C  -0.10425258 -3.5133429 1.26612856
C  -2.02037508 -4.73432519 0.42392376
C  0.64291749 -4.68769337 1.27762634
H  0.37050707 -2.57737137 1.54102452
C  -1.26320058 -5.90635124 0.42419594
H  -3.05192983 -4.75502116 0.09059156
C  0.06427825 -5.88532131 0.8528264
H  1.67777646 -4.65177624 1.60016355
H  -1.71329055 -6.83564588 0.08753807
H  0.65139272 -6.79881779 0.84713181
C  -4.08322283 -2.40378277 0.44595781
C  -5.02704837 -2.69304023 1.44060862
C  -4.4691996 -2.46029685 -0.90325222
C  -6.34013181 -3.01354543 1.0951912
H  -4.74729108 -2.67013438 2.48764665
C  -5.77784194 -2.79881665 -1.24330898
H  -3.74718889 -2.23034834 -1.68051411
C  -6.7181607 -3.06640304 -0.24656368
H  -7.06543565 -3.22391282 1.87537179
H  -6.0637166 -2.84304087 -2.29002484
H  -7.74055293 -3.3166247 -0.51364517
Pd -1.49977701 -0.26733721 -0.52010299
C  0.35652969 -3.68203742 -2.49635025
C  0.26358002 -2.46004738 -1.8117297
C  1.33371792 -2.01284139 -1.032962
C  2.49610646 -2.77596416 -0.94466091
C  2.58493854 -3.99161699 -1.62350642
C  1.51310849 -4.44712842 -2.39745236
H  -0.49109058 -4.01305069 -3.08647046
H  3.31474625 -2.44454681 -0.31715298
H  3.4860415 -4.59232363 -1.53846279
H  1.58097712 -5.39855555 -2.91693675
I  -0.05437992 1.42132367 -2.12826434
H  1.2390195 -1.08695889 -0.48173736
Cu 0.8153862 2.25228768 0.29609314
C  1.82502923 5.10362289 -1.44305417
C  1.63640201 3.97414566 0.76084301
N  1.97624734 5.05399453 0.00284399
N  1.9143019 4.37003872 2.03402613
C  2.44154832 6.10143063 0.78264957
C  2.40316935 5.66486593 2.07054688
C  1.71552768 3.52453461 3.20708687
H  2.75792176 7.0431441 0.36317142
H  2.67688085 6.15530424 2.99117728
H  1.22494539 4.10615292 3.99244992
H  2.67426389 3.13740402 3.55258394
H  1.08991387 2.68018557 2.91388132
H  2.79024237 5.29903801 -1.91838372
H  1.11302885 5.88503873 -1.72142289
H  1.44245742 4.13794965 -1.77140168
C  -1.02061126 -1.7124911 -1.87805941
O  -1.872499 -1.95817913 -2.71113839
B  4.29433349 1.35553318 1.08753913
C  2.48222934 -0.40356543 1.76262469
O  5.37658052 1.62941168 0.28011641
O  4.34878597 2.03929748 2.28260594
C  6.09682189 2.73703325 0.87616842
C  5.670586 2.63199132 2.38231837
C  3.22795492 -1.51067569 2.37128911
C  4.59108764 -1.71893908 2.04998588
C  5.32459548 -2.77835442 2.58304898
C  4.73545695 -3.6829225 3.4639631
C  2.65517323 -2.4483679 3.26662998
C  3.38957963 -3.50074748 3.7997113
H  5.08977111 -1.04603843 1.36168153
H  2.90086701 -4.19522267 4.47857774
H  6.3680577 -2.89422241 2.30083941
H  5.30366244 -4.51098213 3.87617716
H  1.60949935 -2.36580724 3.53953465
C  5.58232443 4.01122557 0.19768872
H  6.12060522 4.899793 0.54050038
H  5.72481945 3.91416956 -0.88189325
H  4.51647242 4.15037664 0.3907202
C  7.58585417 2.55285099 0.61334658
H  7.78213051 2.62624023 -0.45981494
H  8.16846097 3.32891258 1.1206062
H  7.93134824 1.57584138 0.95427631
C  5.56451705 3.96623595 3.11074173
H  5.2357079 3.79883894 4.14068184
H  6.53960618 4.46284322 3.14588295
H  4.8509573 4.63260861 2.62470941
C  6.5285395 1.65151208 3.18799432
H  7.53612361 2.04164579 3.35861779
H  6.05175703 1.47995919 4.15635055
H  6.60405766 0.68643648 2.68111356
C  3.1639555 0.36573294 0.65373185
H  3.58638253 -0.30386855 -0.1057102
H  2.42148738 0.95148082 0.09003086
C  1.22758503 -0.05341297 2.19642347
O  0.43317108 0.88238288 1.7549715
H  0.82041051 -0.62024533 3.04629808
