program: Gaussian 16
title: Title Card Required
version: EM64L-G16RevA.03
method: RB3LYP
basis: GenECP
operation: Freq
keyword: #N
keyword: Geom=AllCheck
keyword: Guess=TCheck
keyword: SCRF=Check
keyword: GenChk
keyword: RB3LYP/GenECP
keyword: Freq
converged: YES YES NO YES
title: Mulliken charges:
elementType: P C H H C H H C H H P C C C C H C H C H H H C C C C H C H C H H H C C C C H C H C H H H C C C C H C H C H H H Pd C C C C C C H H H H H S O O C F F F O
charge: 0.595122 -0.377660 0.146485 0.132490 -0.207934 0.114632 0.125568 -0.388608 0.138807 0.146792 0.677894 -0.126126 -0.087459 -0.104923 -0.086362 0.087871 -0.081597 0.172030 -0.083063 0.087522 0.110305 0.092140 -0.110560 -0.103791 -0.110438 -0.076826 0.084760 -0.085694 0.115746 -0.087069 0.091178 0.100099 0.093725 -0.108206 -0.104247 -0.078179 -0.078243 0.086491 -0.070367 0.109356 -0.082542 0.093339 0.096617 0.094595 -0.130894 -0.087955 -0.093563 -0.084021 0.099219 -0.068626 0.141582 -0.085256 0.096614 0.100756 0.097535 -0.329201 -0.084608 -0.059216 -0.078818 -0.066526 -0.095006 -0.058288 0.086492 0.073481 0.074338 0.074298 0.080881 1.284713 -0.540138 -0.528811 0.662029 -0.262551 -0.270716 -0.276100 -0.625314
chargesum: -0.00000
title: Mulliken charges with hydrogens summed into heavy atoms:
elementType: P C C C P C C C C C C C C C C C C C C C C C C C C C C C C Pd C C C C C C S O O C F F F O
charge: 0.595122 -0.098685 0.032266 -0.103009 0.677894 -0.126126 0.000412 0.067106 0.001161 0.028708 0.009078 -0.110560 -0.019031 0.005308 0.014352 0.014405 0.006656 -0.108206 -0.017756 0.031177 0.015096 0.026249 0.012053 -0.130894 0.011263 0.048019 0.012593 0.032130 0.012279 -0.329201 0.001884 -0.059216 0.002063 0.006955 -0.020669 0.016010 1.284713 -0.540138 -0.528811 0.662029 -0.262551 -0.270716 -0.276100 -0.625314
chargesum: 0.00000
1716.lowfreq: -5.8852 -0.0019 -0.0006 0.0007 4.6501 6.7219 13.7200 21.9961 27.8699
frequency: 13.5907 21.9533 27.8651 35.4795 36.9286 42.1322 43.2492 44.5407 49.1538 54.2045 54.8946 59.0631 63.4771 68.4779 73.4019 80.6092 85.7070 90.2331 93.8927 104.8096 117.1268 125.3460 142.3869 155.3659 166.3338 190.3718 191.5721 194.4661 201.1609 203.0251 215.6750 219.9236 225.3597 229.2764 247.3852 261.3399 264.8379 265.6817 276.4071 290.7773 299.9284 333.4200 341.4967 360.8790 365.3158 397.0566 403.8141 408.0226 412.2649 417.4967 422.7523 435.8141 446.0765 459.1267 475.3460 483.0162 488.6405 495.8816 505.4279 509.5414 523.7500 537.1521 556.9993 558.0362 610.5308 626.5546 631.4489 632.7465 632.9162 634.6202 657.7692 669.9471 689.0146 697.5337 702.1257 709.6822 711.3595 711.6086 716.6729 719.0539 723.3571 732.3391 741.6010 750.2410 752.1277 760.1973 761.7932 767.7742 813.7232 829.0234 848.4539 850.8060 862.1661 863.4487 871.2921 895.6684 923.1098 931.0244 933.5733 943.8607 949.7785 951.4783 955.3318 970.1803 980.7337 982.1886 988.4073 992.8395 997.2563 999.8079 1005.1384 1008.3771 1013.1050 1014.1102 1020.7819 1021.4401 1022.7769 1025.1555 1045.9421 1055.0476 1055.1213 1057.1640 1057.8879 1072.0554 1086.3545 1098.7143 1110.9463 1113.8314 1116.5169 1117.4749 1121.8000 1125.8403 1130.5271 1130.8058 1135.8773 1159.1694 1164.5555 1183.7048 1190.7768 1191.2219 1191.6070 1192.2084 1195.7210 1202.5899 1209.0732 1213.5542 1221.0678 1221.3089 1225.1064 1255.4590 1262.9279 1302.5884 1326.9378 1327.6149 1330.8003 1333.1264 1337.4365 1338.7706 1343.5243 1349.4082 1363.3776 1369.6209 1371.2115 1371.4912 1395.6427 1464.2870 1472.5952 1477.7651 1478.9730 1479.6046 1480.9288 1482.4844 1509.7458 1512.6877 1526.5303 1529.3536 1531.8868 1534.5396 1624.1118 1630.5582 1631.4597 1631.9742 1632.2956 1634.6880 1647.1867 1648.2893 1650.6763 1651.1838 3048.0594 3056.4228 3061.3113 3098.8096 3107.0017 3116.5676 3170.0769 3176.7922 3181.9367 3184.8233 3186.0937 3187.8909 3188.5331 3192.5206 3194.7715 3195.2047 3196.1234 3197.5104 3203.0021 3203.2162 3206.0439 3207.3743 3208.5577 3211.7742 3212.9145 3213.4985 3221.1438 3222.6663 3223.5883 3232.7186 3262.8432
redmass: 5.5931 6.6144 6.4916 6.4407 7.4090 4.9325 6.6868 5.9693 5.6602 4.9511 6.3886 4.7460 5.6331 5.8543 4.1185 9.0584 5.3009 6.2376 5.4776 7.9428 7.1057 6.7555 6.6869 4.8205 7.7985 4.7115 14.4354 4.3182 10.6205 4.0575 5.2728 4.3036 4.0093 5.0179 6.0838 7.5859 5.1744 4.4687 3.8711 4.2950 17.5714 17.1576 17.5299 5.4088 3.2235 2.8411 2.8824 2.9076 2.9856 2.9946 3.1058 4.4775 5.5838 6.2380 3.8635 3.9975 4.0367 12.5523 16.4354 4.4102 4.6150 4.6273 17.7888 17.9857 20.1161 6.4377 6.2256 6.3991 6.4244 6.2663 4.2586 6.4260 4.7642 1.8816 2.1100 3.1470 2.2234 2.5314 3.1841 3.9593 5.5394 5.6677 1.8156 18.3606 1.6167 1.6876 1.5866 1.6937 1.5248 1.2730 1.5493 1.7660 1.2532 1.2485 1.2431 1.3650 1.3342 1.7638 1.3628 1.3165 5.0606 1.4157 1.5513 1.3701 1.3703 1.2664 1.3537 1.3320 1.8926 1.2793 1.2767 1.3555 2.0286 4.3651 5.9440 6.0378 6.0166 2.3276 4.1125 2.8646 2.6595 2.7706 2.8623 1.9906 2.0964 1.6302 1.5888 1.6953 1.6308 1.6668 2.6716 2.1474 2.5789 3.0175 1.4823 11.4283 13.8050 1.0937 1.0995 1.0983 1.0971 1.0961 1.2119 1.1398 11.5610 1.1535 1.1510 1.1525 1.1562 12.0815 1.2634 1.4560 2.2087 18.8426 2.3359 3.1589 3.1153 2.4214 1.3137 2.2950 2.2819 1.7670 1.6999 1.6839 1.3627 1.0912 2.0897 1.5225 2.1496 1.7115 1.6758 2.1952 1.0826 2.0863 2.0640 2.0078 2.0381 2.0102 5.4109 5.1856 5.3876 5.4045 5.3624 5.3472 5.3115 5.4648 5.3350 5.4249 1.0667 1.0603 1.0599 1.1018 1.1016 1.0999 1.0838 1.0865 1.0852 1.0861 1.0855 1.0852 1.0905 1.0891 1.0923 1.0904 1.0900 1.0880 1.0940 1.0978 1.0918 1.0924 1.0952 1.0923 1.0958 1.0958 1.0930 1.0955 1.0968 1.0943 1.0902
irintensity: 0.0124 0.3118 0.0215 0.0678 0.7096 0.1445 0.6898 0.4680 0.5375 0.0948 0.1956 0.3075 0.5460 0.1531 0.4955 0.3359 0.0473 3.1682 1.0608 8.4333 2.0051 7.5908 0.2626 4.2402 0.8774 1.2395 1.1314 2.9154 3.4205 1.3289 6.5656 1.9635 0.9437 0.9679 4.2130 1.0776 3.2870 0.3268 0.8262 0.4800 0.7586 0.7076 1.8215 0.5981 5.3962 0.0284 0.0982 0.9269 0.6647 0.5586 6.7235 13.3998 2.5526 15.7644 3.0818 10.0314 26.0666 15.7694 17.3162 48.0861 76.0429 27.0707 7.8461 7.0064 97.9724 0.6366 1.5730 0.1666 1.1904 0.5328 36.5182 3.9129 0.5597 34.1352 10.9865 6.8611 42.2759 3.3656 18.6996 37.3184 6.5203 5.0135 55.2831 5.7384 12.6752 20.4055 1.1567 14.0894 22.3136 0.6306 9.8752 17.4753 0.2413 0.6282 2.7520 6.4307 0.1888 9.7775 0.2928 1.5206 158.2734 12.7649 26.7283 0.7262 0.8683 0.7571 1.2388 1.9783 37.9108 0.3353 0.2761 1.1942 1.0230 21.5521 4.1476 1.9601 5.2422 3.6802 5.0663 1.7384 0.4492 0.0351 0.4051 3.8776 3.2484 2.3870 0.4324 2.6449 1.9420 1.0512 17.2961 6.7849 22.1333 28.3730 10.7231 355.0436 212.0572 0.0172 0.3900 0.2442 1.8979 0.6853 28.2466 0.3546 135.4096 7.6438 5.4106 6.8700 1.5138 304.5259 1.5660 1.6886 1.8398 200.0068 3.1587 10.4097 4.2596 2.9407 2.6739 0.2201 1.5073 1.2301 1.1831 2.4663 6.3624 8.2848 3.6884 16.2199 17.8802 24.9076 14.9775 13.0569 2.3237 19.1142 2.7771 8.3698 5.7682 6.2366 45.0453 3.3318 1.3558 3.3698 2.3206 0.2770 0.1447 1.5661 0.3798 0.2920 12.9097 17.3118 15.3269 9.5713 6.8402 13.6919 2.8823 3.7995 0.2142 0.9048 0.0357 0.8394 7.5808 6.1438 12.1055 22.0925 9.9239 3.8533 45.0067 23.2869 18.3664 14.7899 22.1354 8.5060 17.4626 22.4348 11.5673 4.5405 9.7533 43.7062 9.1942
temp: 298.150 k
press: 1.00000 atm
elementType: 15 6 1 1 6 1 1 6 1 1 15 6 6 6 6 1 6 1 6 1 1 1 6 6 6 6 1 6 1 6 1 1 1 6 6 6 6 1 6 1 6 1 1 1 6 6 6 6 1 6 1 6 1 1 1 46 6 6 6 6 6 6 1 1 1 1 1 16 8 8 6 9 9 9 8
symmnumber: 1
zpe: 1509567.0 jmol-1
zpe.correction: 0.574964 hartree
zpe.thermalcorrener: 0.616909 hartree
zpe.thermalcorrenthalpy: 0.617854 hartree
zpe.thermalcorrgfe: 0.496495 hartree
zpe.sumelectzpe: -3046.789743 hartree
zpe.sumelectthermal: -3046.747797 hartree
zpe.sumelectthermalent: -3046.746853 hartree
zpe.sumelectthermalfe: -3046.868212 hartree
dipole: 3.9979 13.5105 -2.5463
dipole: 14.3179
quadrupole: -262.1860 -299.8807 -264.3725
quadrupole: -14.0378 -1.6352 9.2040
quadrupole: 13.2937 -24.4010 11.1072 -14.0378 -1.6352 9.2040
hfenergy: -3047.3647063 hartree
pointgroup: C01 [X(C34H31F3O3P2Pd1S1)]
dipole: 1.7613255 5.3277458 -0.4944464 debye
polarizability: 496.9439314|-41.1735913|447.5128523|10.5864967|35.0272644|391.877902 unknown
InChI: InChI=1S/C27H26P2.C6H5.CHF3O3S.Pd/c1-5-14-24(15-6-1)28(25-16-7-2-8-17-25)22-13-23-29(26-18-9-3-10-19-26)27-20-11-4-12-21-27;1-2-4-6-5-3-1;2-1(3,4)8(5,6)7;/h1-12,14-21H,13,22-23H2;1-5H;5H;/q;;;+1/p-1
charge 0 multiplicity 1
75 atoms
P  -1.53356517 0.94673853 -0.74724528
C  -0.97832934 2.12043542 -2.07446915
H  -0.91760997 1.5100477 -2.9828772
H  -1.77261511 2.85311739 -2.25153609
C  0.35894401 2.839126 -1.83396367
H  0.47892955 3.58468554 -2.62870087
H  0.3324158 3.39850755 -0.89431491
C  1.60791757 1.94817775 -1.85359852
H  2.50366715 2.57004035 -1.95001877
H  1.58214035 1.28332998 -2.72308837
P  1.84553559 0.87533502 -0.35923891
C  -3.17346958 0.42809878 -1.37257079
C  -4.24213652 1.33837616 -1.39786194
C  -3.36052691 -0.87974178 -1.83831738
C  -5.4811744 0.94618473 -1.89718083
H  -4.10986322 2.34440137 -1.01081588
C  -4.60783467 -1.26670601 -2.33253673
H  -2.55203465 -1.59785922 -1.77591783
C  -5.66473235 -0.35829994 -2.36527051
H  -6.30590511 1.65263867 -1.91214208
H  -4.74985674 -2.28775052 -2.67187748
H  -6.63519154 -0.66579438 -2.74357485
C  -1.95245124 2.03988043 0.66913661
C  -1.93209452 3.43918045 0.60393517
C  -2.29976966 1.42613479 1.8834056
C  -2.22671218 4.20787238 1.73137225
H  -1.69112216 3.94599891 -0.32266989
C  -2.60858192 2.19451448 3.00298636
H  -2.32697277 0.34715345 1.95298374
C  -2.56302016 3.58876416 2.93391162
H  -2.19631848 5.29122415 1.66468682
H  -2.88043344 1.70197391 3.93177878
H  -2.79317763 4.18751369 3.80992413
C  3.57714529 0.32598351 -0.52439713
C  4.1190654 0.03212984 -1.78220177
C  4.33367086 0.07484553 0.62800884
C  5.40215247 -0.50367451 -1.8853739
H  3.54144373 0.19851559 -2.68525118
C  5.60988445 -0.47010864 0.52064945
H  3.91232478 0.27507641 1.60608836
C  6.14713092 -0.76013706 -0.7347337
H  5.8134879 -0.72966049 -2.86435476
H  6.18073984 -0.67866068 1.41974351
H  7.14045583 -1.19073019 -0.81484677
C  1.85322283 2.03738513 1.04386852
C  2.65673522 3.18814716 1.02989542
C  1.01933207 1.78965402 2.14007027
C  2.60653986 4.08666737 2.09255642
H  3.3257316 3.37659865 0.19539856
C  0.9723641 2.69035536 3.20408877
H  0.39975171 0.90019238 2.14529378
C  1.76065082 3.83983585 3.1781714
H  3.22667546 4.97770784 2.07682772
H  0.30855341 2.49784355 4.03961797
H  1.72045178 4.54462547 4.00312544
Pd 0.22728031 -0.69414388 -0.21500567
C  2.4518766 -2.68696484 -0.47240058
C  1.70937302 -1.91757999 0.42158205
C  1.95812012 -2.00384834 1.7918212
C  2.95144726 -2.86463867 2.26722798
C  3.70082315 -3.62998631 1.37438761
C  3.44584322 -3.54356001 0.00453564
H  2.26714523 -2.61870035 -1.54026192
H  3.13513972 -2.9361994 3.3360772
H  4.47701142 -4.29414867 1.74328722
H  4.02166673 -4.14260901 -0.69562367
H  1.37774942 -1.415937 2.496095
S  -1.49938425 -3.50641282 0.44798615
O  -2.62632067 -4.24986628 -0.11973444
O  -0.40432173 -4.23498977 1.08579707
C  -2.25042811 -2.5125082 1.8236506
F  -2.77126014 -3.30064777 2.76492285
F  -3.22170471 -1.70375033 1.35614564
F  -1.31834051 -1.71941378 2.41190536
O  -1.06476255 -2.3925261 -0.49729647
