program: Gaussian 16
title: Title Card Required
version: ES64L-G16RevA.03
method: RB3LYP
basis: GenECP
operation: Freq
keyword: #N
keyword: Geom=AllCheck
keyword: Guess=TCheck
keyword: SCRF=Check
keyword: GenChk
keyword: RB3LYP/GenECP
keyword: Freq
converged: YES YES NO YES
title: Mulliken charges:
elementType: P C H H C H H C H H P C C C C H C H C H H H C C C C H C H C H H H C C C C H C H C H H H C C C C H C H C H H H Pd C C C C C C H H H H I H C O
charge: 0.584124 -0.377219 0.144001 0.136554 -0.205441 0.110842 0.117094 -0.370995 0.131291 0.143620 0.606803 -0.117746 -0.094506 -0.100567 -0.082794 0.104627 -0.083666 0.130888 -0.088015 0.091369 0.100607 0.093817 -0.111719 -0.096789 -0.081906 -0.074852 0.087962 -0.087342 0.124656 -0.084477 0.091110 0.095990 0.092482 -0.094539 -0.093280 -0.101211 -0.078587 0.132434 -0.080529 0.092451 -0.084106 0.095110 0.086583 0.088852 -0.130174 -0.100423 -0.095058 -0.085697 0.088800 -0.068186 0.153683 -0.084572 0.089413 0.093734 0.090235 -0.538298 -0.107289 0.079088 -0.089547 -0.091836 -0.079806 -0.099322 0.139830 0.085213 0.084673 0.089229 -0.311785 0.112465 0.259129 -0.376477
chargesum: -0.00000
title: Mulliken charges with hydrogens summed into heavy atoms:
elementType: P C C C P C C C C C C C C C C C C C C C C C C C C C C C C Pd C C C C C C I C O
charge: 0.584124 -0.096665 0.022496 -0.096084 0.606803 -0.117746 0.010121 0.030320 0.008575 0.016942 0.005802 -0.111719 -0.008827 0.042749 0.016258 0.008648 0.008005 -0.094539 0.039153 -0.008760 0.016523 0.006054 0.004746 -0.130174 -0.011624 0.058625 0.003715 0.025548 0.005663 -0.538298 0.032541 0.079088 0.022919 -0.006623 0.004867 -0.010093 -0.311785 0.259129 -0.376477
chargesum: 0.00000
1716.lowfreq: -6.8041 -0.0010 -0.0008 0.0011 2.6283 4.1451 13.7269 22.3306 23.9414
frequency: 12.8864 22.2912 23.7311 34.6436 36.9715 46.5456 47.8041 48.8772 53.8122 59.7363 62.6504 69.3651 74.7617 78.7971 87.1368 92.8008 100.5903 107.8920 121.6735 131.3141 142.1447 157.9703 167.2982 182.7690 193.7204 199.2037 209.7290 219.4512 224.7403 231.4648 243.4061 254.8692 257.0835 264.5108 274.5707 289.2498 353.9244 360.2081 406.0016 408.3657 410.1328 410.6266 415.2124 416.6178 418.7286 432.2623 441.7159 463.3428 487.0775 490.1106 492.1999 499.1934 518.2858 529.6017 625.0712 632.1397 632.8548 633.5201 633.7027 640.9253 651.5392 676.8713 683.8211 705.5578 705.5970 708.0205 711.2664 712.4172 715.3032 716.4670 727.0339 730.1254 757.5475 760.0527 761.9709 764.3346 774.9444 806.6893 844.8679 857.4514 857.9776 864.5300 865.6643 871.7048 877.8385 927.0628 930.8500 933.0081 938.6755 943.6242 946.9678 975.8100 976.7623 984.1194 984.5270 989.0777 995.6280 1000.7675 1001.4313 1001.7017 1004.0147 1009.7833 1020.0742 1020.4316 1021.2242 1021.5423 1023.4835 1055.4316 1055.5826 1055.8639 1056.3234 1057.1222 1073.4371 1109.7468 1110.2332 1112.2412 1113.5369 1115.7155 1124.0659 1125.8080 1126.4768 1130.5192 1135.9163 1185.5917 1189.2894 1189.7167 1190.4169 1190.4738 1195.2151 1197.1506 1212.9184 1214.9957 1217.1898 1217.3935 1220.3429 1264.5986 1302.6483 1331.8171 1332.1721 1333.8746 1335.8017 1338.9252 1343.6743 1362.5442 1364.5968 1365.5136 1365.8715 1367.8950 1396.6895 1462.7867 1475.8299 1478.0830 1478.3466 1480.1561 1480.4912 1483.2612 1507.5021 1526.2671 1528.2294 1528.2953 1528.8961 1531.5357 1630.3946 1630.5683 1630.6474 1631.8391 1632.1474 1647.9362 1648.3051 1649.5178 1650.4614 1650.7723 1772.9750 3042.4642 3052.1549 3055.9171 3095.9101 3099.4077 3115.1990 3180.8123 3182.6096 3183.7167 3186.2326 3186.7474 3190.3784 3191.8948 3193.2326 3195.1586 3197.1431 3197.4061 3201.0350 3203.2424 3204.5028 3205.0844 3208.6287 3209.3568 3210.4968 3213.8369 3214.4268 3214.6878 3220.1864 3224.5661 3226.4304 3236.1924
redmass: 8.1032 5.6505 5.3636 5.6571 5.6551 5.2295 5.5583 5.4445 4.4673 4.2247 5.2021 6.4115 4.9659 5.8200 4.2572 5.4313 6.5427 8.0514 10.5273 6.2013 6.8395 7.7384 5.8283 5.8026 2.8375 4.3819 7.4633 4.5135 4.6205 4.9513 6.5945 4.7118 4.2820 3.4687 4.2502 14.6113 3.5954 3.9181 2.9276 3.1104 3.0767 3.6640 2.9854 2.9452 3.5414 5.8075 5.1221 8.0285 4.0142 3.7688 4.6874 4.7842 4.7988 4.2569 6.4983 6.0754 6.3358 6.2962 6.3666 6.2113 4.3233 6.6035 4.7669 2.2003 2.3484 2.0755 2.2126 3.4447 3.5715 2.7658 5.8765 5.4959 1.6182 1.7004 1.7304 1.6233 1.8077 1.5214 2.4161 1.2547 1.2481 1.2460 1.2691 1.2661 4.8403 1.6996 1.3802 1.4019 1.3292 1.3622 1.3795 1.3689 1.3776 1.3630 1.3561 1.3451 1.8286 1.2579 1.2844 1.2805 1.2726 1.2721 5.8250 6.0606 5.7594 6.0576 5.9322 2.7707 2.8052 2.6798 2.2560 2.6939 1.9270 1.5568 1.6193 1.6211 1.6184 1.6582 2.8960 2.9209 2.0272 2.9222 1.4254 1.1078 1.0971 1.0976 1.0993 1.0962 1.6601 1.2760 1.8295 1.1432 1.1577 1.1429 1.1469 1.2466 1.4523 2.6661 2.6964 2.7544 2.7187 1.7541 1.2486 3.0325 1.9274 1.8841 1.8704 1.8385 1.3496 1.0918 1.1917 2.1360 1.9822 2.1627 2.0558 2.2363 1.0829 2.1485 2.0467 2.0458 2.0530 2.0395 5.3323 5.4306 5.2697 5.3189 5.2699 5.4213 5.4210 5.4594 5.5120 5.4542 13.0617 1.0677 1.0593 1.0614 1.1022 1.1045 1.0957 1.0852 1.0850 1.0851 1.0855 1.0855 1.0881 1.0895 1.0879 1.0912 1.0884 1.0900 1.0919 1.0938 1.0947 1.0925 1.0955 1.0937 1.0953 1.0978 1.0978 1.0960 1.0943 1.0932 1.0920 1.0913
irintensity: 0.4329 0.1517 0.0478 0.0192 0.0699 0.1321 0.9884 0.0304 0.2756 0.1056 0.1486 0.7728 0.2207 0.0707 0.1535 0.2396 0.7773 1.5108 1.8473 0.1534 0.7153 1.1080 2.5446 3.1646 1.2572 0.0678 3.6973 1.4299 0.7025 1.0125 0.2737 0.9215 0.6727 0.8232 0.2328 13.4730 2.4093 2.6574 0.2161 0.6211 0.3817 0.6709 0.6034 4.7054 1.1401 13.9383 3.3885 6.0824 25.2417 1.9354 7.8237 25.0533 86.8469 5.1556 30.0693 4.1597 0.8800 1.1280 0.2025 38.3480 41.2159 42.3475 2.5331 0.7607 22.0781 55.8559 28.2905 6.5630 37.8191 11.8900 11.1249 4.1935 15.5977 24.6508 7.9747 3.3701 13.9068 18.3446 33.2239 0.7984 2.5559 0.6673 4.0133 1.6896 112.3909 3.1852 0.4232 0.7773 0.8364 4.3981 3.4099 0.2794 0.2077 0.9242 0.2968 0.0283 31.9176 0.9229 0.1168 0.1868 0.0525 0.0190 2.8696 0.8324 2.2513 0.4337 2.3698 0.8480 1.3944 0.2422 1.1176 0.9326 3.6000 3.4797 1.1991 0.0450 0.3672 0.5482 16.4462 15.7300 4.1496 26.9819 1.1073 1.4579 1.7077 0.1848 0.7337 0.3151 54.9571 51.7619 28.6759 4.9447 3.3235 3.3298 0.3213 1.2683 3.9571 1.7384 6.4587 7.7598 6.9501 2.7242 2.2816 2.6685 1.2927 0.4298 0.3898 2.4386 5.5783 5.7814 13.1086 11.4796 14.7007 9.4717 36.2966 8.8084 2.5157 2.8968 10.3266 7.7495 3.5200 4.5944 0.7356 4.3084 0.3760 1.5963 0.9849 0.8691 0.4216 1.5635 4.8551 0.2359 347.2445 12.7252 12.2563 26.7049 10.1525 4.1880 17.1344 0.5622 0.4253 0.8244 0.2405 0.5821 2.6734 15.2555 4.7304 7.0957 6.2194 9.8034 17.1278 15.3073 18.9052 17.4485 18.7809 15.2225 21.8629 30.1275 15.6244 12.4466 9.7002 8.5352 10.8786 14.5112
temp: 298.150 k
press: 1.00000 atm
elementType: 15 6 1 1 6 1 1 6 1 1 15 6 6 6 6 1 6 1 6 1 1 1 6 6 6 6 1 6 1 6 1 1 1 6 6 6 6 1 6 1 6 1 1 1 6 6 6 6 1 6 1 6 1 1 1 46 6 6 6 6 6 6 1 1 1 1 53 1 6 8
symmnumber: 1
zpe: 1461406.5 jmol-1
zpe.correction: 0.556620 hartree
zpe.thermalcorrener: 0.593859 hartree
zpe.thermalcorrenthalpy: 0.594803 hartree
zpe.thermalcorrgfe: 0.483022 hartree
zpe.sumelectzpe: -2210.148574 hartree
zpe.sumelectthermal: -2210.111335 hartree
zpe.sumelectthermalent: -2210.110391 hartree
zpe.sumelectthermalfe: -2210.222172 hartree
dipole: -2.1496 10.0985 -2.5714
dipole: 10.6402
quadrupole: -241.6203 -269.8431 -250.8072
quadrupole: 4.0323 -8.0655 9.2387
quadrupole: 12.4699 -15.7529 3.2830 4.0323 -8.0655 9.2387
hfenergy: -2210.705194 hartree
pointgroup: C01 [X(C34H31I1O1P2Pd1)]
dipole: -2.6177858 2.840495 -1.6133183 debye
polarizability: 472.378618|5.1094245|465.6034325|-85.711629|-7.1939935|433.8794066 unknown
InChI: InChI=1S/C27H26P2.C7H5O.HI.Pd/c1-5-14-24(15-6-1)28(25-16-7-2-8-17-25)22-13-23-29(26-18-9-3-10-19-26)27-20-11-4-12-21-27;8-6-7-4-2-1-3-5-7;;/h1-12,14-21H,13,22-23H2;1-5H;1H;/q;;;+1/p-1
charge 0 multiplicity 1
70 atoms
P  -1.28267665 0.08391239 -0.26042878
C  -1.71000552 0.14233509 -2.06772308
H  -1.73381797 -0.90843476 -2.37779915
H  -2.73808708 0.51164536 -2.14998281
C  -0.79392648 0.94502027 -3.00530225
H  -1.26915195 0.94090452 -3.99376671
H  -0.759493 1.99126582 -2.69062291
C  0.64080997 0.42770554 -3.17370388
H  1.11883255 0.93840482 -4.01612386
H  0.64142769 -0.64143935 -3.41477395
P  1.72348845 0.59634761 -1.66884447
C  -2.72172875 -0.83546201 0.39809533
C  -3.70417026 -0.23267862 1.19292009
C  -2.80609303 -2.20787378 0.11750646
C  -4.75814759 -0.9933253 1.69956412
H  -3.63911766 0.82326735 1.4285275
C  -3.86384193 -2.96198616 0.6199861
H  -2.02112335 -2.69431608 -0.45181705
C  -4.84032378 -2.35659868 1.41506862
H  -5.51140243 -0.51949032 2.32179522
H  -3.91409114 -4.02515539 0.40715726
H  -5.65786823 -2.94812268 1.81595818
C  -1.5013574 1.78587925 0.37115645
C  -2.02668638 2.83545039 -0.39252425
C  -1.10731837 2.0359484 1.69511665
C  -2.1288341 4.11776504 0.14898065
H  -2.36016164 2.66519049 -1.40919209
C  -1.23791832 3.30913507 2.24164626
H  -0.69649409 1.23363131 2.29510742
C  -1.73665172 4.3574036 1.46544278
H  -2.51988959 4.92732493 -0.45959697
H  -0.93644953 3.48077402 3.27052563
H  -1.82014368 5.35569594 1.88426643
C  3.36436815 0.22353303 -2.381766
C  3.73223972 -1.12519344 -2.49456371
C  4.24019494 1.2186878 -2.83218555
C  4.94825317 -1.47220773 -3.0793449
H  3.08178808 -1.89627089 -2.09457384
C  5.46281369 0.86668858 -3.40472348
H  3.97515524 2.26520935 -2.72675945
C  5.81550983 -0.47717726 -3.53424915
H  5.22767217 -2.51828179 -3.15771889
H  6.1409675 1.64359461 -3.74528755
H  6.76921403 -0.7484092 -3.97713409
C  1.70730758 2.39061547 -1.31891189
C  1.55308961 3.37164662 -2.31008357
C  1.79453819 2.78419093 0.02418166
C  1.47693791 4.71989029 -1.96249284
H  1.48831037 3.08622209 -3.35553968
C  1.72279399 4.1325432 0.36921609
H  1.90516003 2.02321456 0.79059868
C  1.55808033 5.10076693 -0.62172148
H  1.35219746 5.47145481 -2.73640901
H  1.77867405 4.42387387 1.41291254
H  1.49024011 6.15011564 -0.35079953
Pd 0.86400026 -0.70094533 0.20757411
C  0.55940969 -0.37446918 3.6041112
C  -0.24994177 -1.32064946 2.96230491
C  -1.50606787 -1.64298891 3.49563383
C  -1.96090976 -0.99800046 4.64421611
C  -1.15153577 -0.05875827 5.28661186
C  0.11504487 0.23833461 4.77463621
H  1.53145526 -0.1425348 3.1821706
H  -2.94641118 -1.2293302 5.03752302
H  -1.50418411 0.43777065 6.18601932
H  0.75389777 0.95415478 5.28362328
I  3.30244335 -1.36480679 1.17499158
H  -2.12184455 -2.37544053 2.98630696
C  0.11896178 -1.92823266 1.64470734
O  -0.15989918 -3.06840403 1.35017936
