program: Gaussian 16
title: Title Card Required
version: ES64L-G16RevA.03
method: RB3LYP
basis: GenECP
operation: Freq
keyword: #N
keyword: Geom=AllCheck
keyword: Guess=TCheck
keyword: SCRF=Check
keyword: GenChk
keyword: RB3LYP/GenECP
keyword: Freq
converged: YES YES NO YES
title: Mulliken charges:
elementType: P C H H C H H C H H P C C C C H C H C H H H C C C C H C H C H H H C C C C H C H C H H H C C C C H C H C H H H Pd C C C C C C H H H H I H
charge: 0.614886 -0.372340 0.138600 0.130604 -0.208253 0.110285 0.128068 -0.373082 0.135008 0.132348 0.652846 -0.102260 -0.091544 -0.090047 -0.084004 0.093069 -0.079458 0.137365 -0.083227 0.088075 0.095444 0.090048 -0.125067 -0.100338 -0.101122 -0.079355 0.083950 -0.086450 0.154573 -0.089444 0.089980 0.102856 0.092424 -0.113652 -0.105165 -0.081220 -0.079489 0.085308 -0.070396 0.110814 -0.084854 0.090353 0.093570 0.091068 -0.123751 -0.094874 -0.096959 -0.083277 0.101912 -0.078045 0.145772 -0.086257 0.093776 0.100267 0.094697 -0.518038 -0.088948 -0.052003 -0.096703 -0.072995 -0.102993 -0.059861 0.088893 0.068470 0.068982 0.069514 -0.300798 0.082441
chargesum: -0.00000
title: Mulliken charges with hydrogens summed into heavy atoms:
elementType: P C C C P C C C C C C C C C C C C C C C C C C C C C C C C Pd C C C C C C I
charge: 0.614886 -0.103136 0.030100 -0.105726 0.652846 -0.102260 0.001525 0.047317 0.004071 0.015986 0.006821 -0.125067 -0.016388 0.053451 0.010626 0.016406 0.002980 -0.113652 -0.019857 0.029594 0.010864 0.023174 0.006214 -0.123751 0.007038 0.048813 0.010499 0.022222 0.008440 -0.518038 -0.000055 -0.052003 -0.014262 -0.004525 -0.034011 0.009653 -0.300798
1716.lowfreq: 0.0003 0.0007 0.0008 0.0884 4.1609 11.2335 20.8251 22.2411 31.3521
frequency: 20.7612 22.0825 31.3216 37.4868 39.6661 44.3232 48.8621 52.1581 58.8069 60.4833 68.0351 69.8320 72.0231 79.1653 82.8561 96.5664 110.8277 118.3849 143.1545 148.1975 161.1594 189.0045 194.0588 202.3836 216.7242 220.5175 227.8574 230.4820 248.3218 259.0011 264.9045 268.2018 275.2548 290.1407 349.9220 369.9756 400.9725 404.0977 409.3907 411.3942 417.7372 427.5193 437.8886 444.1856 463.1885 481.7986 484.6688 490.5913 504.4192 525.1541 536.5869 629.0074 631.9562 632.9251 633.3872 633.9348 658.4351 668.4967 687.9178 703.1773 706.1245 706.8182 710.9565 713.6875 717.7537 719.7554 726.8525 730.4190 742.4349 753.2899 760.4171 764.2473 766.4516 813.8743 842.6402 851.1508 853.0844 858.8928 871.3714 872.2368 901.3171 924.9223 933.3565 936.5510 943.6290 949.2164 960.4339 971.2426 977.9137 982.7521 990.2665 992.3476 997.7648 999.0442 1003.3147 1012.6950 1014.8004 1015.4931 1020.3612 1020.5031 1021.2020 1022.1228 1044.5206 1054.5154 1055.2161 1056.6698 1057.5345 1069.7358 1086.9395 1096.3103 1110.1552 1111.1366 1114.6584 1117.5304 1124.7429 1127.3759 1128.9570 1131.5072 1133.1300 1182.2639 1189.5311 1189.7371 1190.6259 1191.2706 1192.5657 1203.8375 1214.2987 1214.5612 1220.4050 1226.1473 1262.5758 1302.5727 1323.4516 1328.3533 1331.6206 1335.4471 1337.9723 1340.0627 1349.0617 1363.9047 1364.5985 1369.3504 1372.5298 1388.5866 1463.7906 1470.0035 1476.6555 1477.8258 1479.7135 1482.1074 1483.5417 1510.6690 1515.8903 1527.0874 1528.1636 1531.5977 1532.8271 1623.0151 1627.0141 1629.5902 1630.2075 1632.5067 1633.6777 1647.8412 1648.4655 1648.8472 1651.5277 3046.8340 3055.4532 3061.5139 3093.3043 3102.4828 3114.7968 3164.3754 3172.0691 3180.5831 3182.9058 3184.3532 3184.4331 3184.6118 3186.6297 3189.7873 3191.9090 3193.5728 3193.8409 3197.3089 3198.8501 3200.0375 3203.0561 3204.8799 3207.5501 3208.0388 3212.1024 3212.3019 3215.0374 3217.3510 3222.3387 3231.2373
redmass: 6.2756 6.6396 5.0213 4.8051 5.2893 5.9989 5.5506 5.5391 5.1366 4.7781 5.0473 5.1948 4.3178 4.1761 5.9081 6.2239 7.7281 5.6876 9.7468 5.0313 4.7783 5.4532 4.2083 3.6215 4.2104 5.0804 3.9469 5.3029 7.1537 10.9330 4.9501 5.0340 3.5383 4.2661 4.5731 3.3825 2.8689 2.8987 2.9802 2.9298 2.9903 3.3514 3.8921 5.4063 7.0135 4.2214 3.6711 3.5973 4.2052 4.8895 4.4142 6.4049 6.2359 6.4111 6.2885 6.4090 4.3087 6.2465 4.7612 2.1301 2.5596 2.0717 3.0927 2.9183 2.7130 2.9902 6.0880 4.9633 1.7570 1.6625 1.6027 1.6484 1.6506 1.5276 1.2621 1.9792 1.3880 1.2520 1.2401 1.2420 1.3578 1.3315 1.4540 1.5939 1.3286 1.3208 1.3735 1.3696 1.3670 1.2427 1.3278 1.3602 1.2879 1.8410 1.2973 1.8943 1.3386 2.2713 5.8453 5.8007 5.7079 5.8798 4.3961 2.7008 2.7736 2.8220 2.7685 2.1574 2.0480 1.6482 1.5965 1.6045 1.5957 1.6664 1.8642 2.7840 2.8041 3.0518 1.5577 1.0908 1.0989 1.1003 1.1097 1.0968 1.1791 1.1375 1.1421 1.1422 1.1430 1.1543 1.2585 1.4530 2.5277 2.4732 2.7945 2.3674 2.6443 1.4380 2.0299 2.0547 1.9747 1.7921 1.6210 1.3827 1.0947 2.0834 2.0736 2.0827 2.0524 2.1951 1.1684 2.0778 1.0831 2.0435 2.0589 2.0422 1.9760 5.4084 5.5003 5.1388 5.2153 5.3554 5.3369 5.3643 5.4529 5.3320 5.4378 1.0647 1.0604 1.0593 1.0998 1.1025 1.1041 1.0837 1.0864 1.0886 1.0850 1.0857 1.0878 1.0872 1.0879 1.0936 1.0880 1.0882 1.0892 1.0911 1.0981 1.0918 1.0926 1.0928 1.0948 1.0954 1.0967 1.0939 1.0974 1.0938 1.0952 1.0931
irintensity: 0.2164 0.0249 0.0650 0.0721 0.1092 0.3494 0.2881 0.4705 0.3232 0.3808 0.2090 0.2405 0.7820 0.0343 0.1866 0.3970 0.9327 1.2689 4.9399 0.8438 0.7252 1.9088 1.2517 0.3984 1.5103 3.3716 0.0030 0.8432 1.2764 4.1608 0.4838 0.5160 0.8139 0.5021 1.9479 3.9483 0.0346 0.0590 0.6812 0.2098 0.2895 6.9032 14.2963 3.9804 8.4013 12.4017 0.1113 17.8149 40.6579 94.0512 13.4968 0.1047 2.2225 0.1965 1.2392 0.3071 44.1395 2.7628 0.5441 29.1282 10.4418 18.3600 8.9129 16.4843 23.6880 39.0874 7.3615 3.6466 62.1974 12.8534 8.6933 13.4489 10.5771 28.9302 0.5650 19.9456 8.1452 0.3978 0.7464 1.0831 6.3997 0.3794 3.2420 6.2663 0.5990 2.3282 0.2481 0.7193 0.0580 0.6738 0.2652 2.1553 2.5416 38.1733 0.1167 5.0207 0.5895 13.7194 1.7870 1.9808 3.1593 1.7369 10.4857 0.7799 1.6686 0.1334 0.6060 4.7061 6.9632 2.2380 1.2438 0.1890 2.1303 0.4180 3.4905 29.3023 24.5516 19.4133 5.5646 0.0194 0.3191 0.3495 5.7249 1.0441 25.5301 0.2051 4.7258 7.0065 1.7024 3.4547 1.3370 4.3233 0.9041 2.9743 8.5705 6.4416 1.9544 0.5112 0.1808 1.7108 0.4922 0.7066 1.0155 5.2831 5.1680 3.2385 17.4629 17.1213 10.6561 15.1547 22.4328 19.0753 2.2021 4.2198 6.6482 6.7488 7.6914 37.5763 12.2375 0.4950 1.5051 1.4985 0.5039 0.3591 1.0218 0.5667 0.9462 17.0525 17.0421 12.1497 15.7191 10.8460 10.8799 4.2008 5.4773 11.1820 0.1250 0.5346 1.9326 5.8164 7.5894 32.3937 2.0615 4.1801 7.6501 4.4815 43.4284 14.0303 21.1175 18.9959 26.8625 27.6964 30.1456 11.5451 16.4295 15.3390 5.3523 2.2920
temp: 298.150 k
press: 1.00000 atm
elementType: 15 6 1 1 6 1 1 6 1 1 15 6 6 6 6 1 6 1 6 1 1 1 6 6 6 6 1 6 1 6 1 1 1 6 6 6 6 1 6 1 6 1 1 1 6 6 6 6 1 6 1 6 1 1 1 46 6 6 6 6 6 6 1 1 1 1 53 1
symmnumber: 1
zpe: 1435743.2 jmol-1
zpe.correction: 0.546846 hartree
zpe.thermalcorrener: 0.582092 hartree
zpe.thermalcorrenthalpy: 0.583036 hartree
zpe.thermalcorrgfe: 0.476182 hartree
zpe.sumelectzpe: -2096.809413 hartree
zpe.sumelectthermal: -2096.774166 hartree
zpe.sumelectthermalent: -2096.773222 hartree
zpe.sumelectthermalfe: -2096.880076 hartree
dipole: -1.3908 8.3339 5.3548
dipole: 10.0032
quadrupole: -234.3578 -249.1855 -245.8173
quadrupole: 5.3387 1.1831 -16.7067
quadrupole: 8.7624 -6.0653 -2.6971 5.3387 1.1831 -16.7067
hfenergy: -2097.3562583 hartree
pointgroup: C01 [X(C33H31I1P2Pd1)]
dipole: 3.083635 -1.2013676 2.1298926 debye
polarizability: 361.1037263|18.2998654|505.2223076|2.3302248|24.2207899|475.2733569 unknown
InChI: InChI=1S/C27H26P2.C6H5.HI.Pd/c1-5-14-24(15-6-1)28(25-16-7-2-8-17-25)22-13-23-29(26-18-9-3-10-19-26)27-20-11-4-12-21-27;1-2-4-6-5-3-1;;/h1-12,14-21H,13,22-23H2;1-5H;1H;/q;;;+1/p-1
charge 0 multiplicity 1
68 atoms
P  -1.2613434 4.03964333 2.7016609
C  0.53867517 3.6390506 2.92229671
H  0.98892285 3.81102213 1.93791472
H  0.98279613 4.38319064 3.59178152
C  0.86473765 2.21724026 3.40485809
H  1.93082294 2.18679962 3.65808374
H  0.32595767 1.99316005 4.33140884
C  0.59856633 1.10986621 2.37412399
H  1.12866701 0.19587952 2.65981368
H  0.97762282 1.41336309 1.39292404
P  -1.19452601 0.66996805 2.17813413
C  -1.14196927 5.76301746 2.10565082
C  -0.90740161 6.82816976 2.98510222
C  -1.23793359 6.0056592 0.72970485
C  -0.75932858 8.1228707 2.48944749
H  -0.85485242 6.64666117 4.05435204
C  -1.08064895 7.3006872 0.23751478
H  -1.46971802 5.1867522 0.05741808
C  -0.84236882 8.35899025 1.11556085
H  -0.58483019 8.94702199 3.1747542
H  -1.16465697 7.48459693 -0.82908033
H  -0.73200574 9.36877226 0.73148274
C  -1.91708422 4.16778218 4.40974938
C  -1.11385946 4.09580956 5.55521535
C  -3.31108619 4.26922836 4.55928512
C  -1.69047834 4.10584783 6.826742
H  -0.03552077 4.02467874 5.47017983
C  -3.88200262 4.28953664 5.82995799
H  -3.9409666 4.31685401 3.67519712
C  -3.07459287 4.19911995 6.96715006
H  -1.0556702 4.0395073 7.70526268
H  -4.96021353 4.36933826 5.93031685
H  -3.52239516 4.20431083 7.95645283
C  -1.14180782 -0.80753892 1.11128155
C  -0.32763287 -0.81676076 -0.0298195
C  -2.01423412 -1.87955298 1.34084679
C  -0.37784368 -1.88757855 -0.92066473
H  0.33436551 0.01733652 -0.2403687
C  -2.06773786 -2.94294191 0.44333881
H  -2.67490061 -1.86519194 2.19884601
C  -1.24921887 -2.95189275 -0.68652579
H  0.25702477 -1.88525231 -1.80150752
H  -2.76157292 -3.7582341 0.62153137
H  -1.29679595 -3.77985441 -1.38725129
C  -1.6194299 0.05921383 3.84642205
C  -0.96168108 -1.0441202 4.41225667
C  -2.56127043 0.76261492 4.60763716
C  -1.23932137 -1.42755074 5.72248954
H  -0.24400446 -1.60894257 3.82467773
C  -2.83033217 0.38362305 5.92312842
H  -3.07238035 1.61258636 4.17068951
C  -2.16936137 -0.71018348 6.48099813
H  -0.73018949 -2.28420234 6.15379586
H  -3.54983769 0.95046751 6.50475716
H  -2.37790502 -1.00851158 7.50409974
Pd -2.57916887 2.39166472 1.54264868
C  -3.61007888 0.50490378 -0.55680521
C  -3.75665646 0.91141675 0.77297766
C  -4.67247645 0.24183769 1.59054507
C  -5.42573259 -0.82425917 1.08684445
C  -5.26957911 -1.23010121 -0.23844007
C  -4.36179211 -0.55841549 -1.06012771
H  -2.90218596 1.01137813 -1.20611251
H  -6.13485669 -1.33487238 1.73394992
H  -5.8514106 -2.06014704 -0.62920061
H  -4.23452883 -0.86507039 -2.09507282
I  -4.46208776 4.14520478 0.743552
H  -4.80552997 0.54290587 2.62556385
