program: Gaussian 09
title: 000005823
version: EM64L-G09RevD.01
frameworkgroup: C1[X(C8H9N5O3)]
method: RPBEPBE
basis: SDD
operation: Freq
keyword: #pfreq=noraman
keyword: PBEPBE/SDD
title: #p freq=noraman PBEPBE/SDD
converged: YES YES NO NO
title: Mulliken charges:
elementType: O O O N N N N N C C C C C C C C H H H H H H H H H
charge: -0.356148 -0.227909 -0.223846 -0.445703 0.017917 -0.248959 -0.619907 -0.637641 0.482029 -0.424272 -0.310953 0.388236 -0.346734 -0.362655 0.188829 0.291481 0.233154 0.316672 0.284511 0.283103 0.331146 0.317949 0.349301 0.408778 0.311620
chargesum: 0.00000
title: Mulliken charges with hydrogens summed into heavy atoms:
elementType: O O O N N N N N C C C C C C C C
charge: -0.356148 -0.227909 -0.223846 -0.114557 0.017917 -0.248959 0.047343 0.082757 0.482029 -0.191118 0.005719 0.388236 -0.062222 -0.079552 0.188829 0.291481
polarizability: 3.21783936e+02 -2.83186511e+00 1.37958811e+02 -1.19189720e-02 -1.87966844e-02 5.32794755e+01
1716.lowfreq: -7.8260 -1.9254 0.0011 0.0012 0.0013 4.2672 34.8776 48.4053 78.1269
frequency: 34.8763 48.4007 78.1265 78.9007 94.4256 137.1236 187.0137 195.7538 221.2808 281.5927 296.9709 318.4409 375.8809 405.8160 418.6190 434.0885 496.2219 501.9193 504.3204 511.8030 549.9998 622.8922 647.0963 667.5794 672.1317 702.8212 734.0450 746.7905 764.3414 775.3353 835.6686 836.0274 845.2061 877.8056 907.0934 978.8338 996.6231 1001.1553 1010.8605 1051.4294 1096.5968 1111.0010 1118.8499 1176.4396 1225.8511 1252.0414 1301.9555 1307.6172 1348.7299 1386.9452 1426.3849 1454.8156 1485.2044 1500.8463 1544.2054 1561.4332 1590.7117 1608.7287 1618.3128 1655.1228 3131.5614 3176.0760 3184.0201 3197.2189 3276.5542 3530.2707 3556.6804 3624.9836 3709.8697
redmass: 7.3589 5.8485 5.9298 6.4674 7.3094 6.3883 7.0261 6.5350 8.4269 5.2235 1.3400 2.8633 7.0162 4.6978 3.0468 5.5091 1.2059 3.5711 3.0404 5.8211 1.1511 7.0977 7.3547 3.9729 2.2669 3.1403 4.3895 3.0134 7.3186 8.0439 1.3871 5.5786 1.1577 1.4992 7.2076 1.3371 3.2268 2.4333 1.3094 1.7412 3.0882 1.7194 1.4372 1.4441 4.1776 1.6883 1.4548 4.2582 7.8557 5.3636 5.6960 2.7039 2.0687 3.1082 2.6029 4.2207 5.3818 1.6183 4.3257 1.9385 1.0905 1.0901 1.0946 1.0961 1.0634 1.0759 1.0455 1.0895 1.1052
irintensity: 0.8568 0.1101 1.1840 0.2948 11.7616 0.7572 8.6297 5.2395 0.4317 10.7757 4.4782 11.5775 5.1564 2.8109 0.0305 9.0843 433.0998 2.4989 18.1501 0.2335 0.1682 0.9644 0.7445 6.0953 55.7429 12.4915 0.3938 30.5558 32.6575 9.0171 31.7921 0.7771 178.7109 99.2394 9.2954 0.5577 11.7973 36.4219 0.6007 41.6861 22.4832 24.6066 31.6972 377.7061 859.4017 121.6186 61.9622 201.1953 135.7828 604.4187 59.8344 7.8102 163.4813 1389.1674 184.7807 216.2544 12.8417 185.2206 396.0505 558.5107 12.0649 2.6888 2.6793 5.4171 190.6650 38.8162 109.3652 73.2730 41.9214
temp: 298.150 k
press: 1.00000 atm
elementType: 8 8 8 7 7 7 7 7 6 6 6 6 6 6 6 6 1 1 1 1 1 1 1 1 1
symmnumber: 1
zpe: 478532.2 jmol-1
zpe.correction: 0.182263 hartree
zpe.thermalcorrener: 0.196701 hartree
zpe.thermalcorrenthalpy: 0.197646 hartree
zpe.thermalcorrgfe: 0.139790 hartree
zpe.sumelectzpe: -808.488705 hartree
zpe.sumelectthermal: -808.474266 hartree
zpe.sumelectthermalent: -808.473322 hartree
zpe.sumelectthermalfe: -808.531178 hartree
dipole: 12.6508 -2.1115 0.0042
dipole: 12.8258
quadrupole: -79.8319 -84.0024 -96.0779
quadrupole: 4.4941 0.0482 0.0274
quadrupole: 6.8055 2.6350 -9.4405 4.4941 0.0482 0.0274
hfenergy: -808.670968 hartree
pointgroup: C01 [X(C8H9N5O3)]
dipole: 4.9844476 -0.7764159 0.1236726 debye
dipolederiv: -0.9745361 0.0168777 -0.0179657 -0.1695264 -0.9749921 -0.0271733 -0.024425 -0.0214396 -0.3630034 -1.0714865 -0.1944999 -0.0306976 -0.4799049 -0.6104451 -0.0262355 -0.0401695 -0.0178595 -0.2492244 -0.8356334 0.2061085 -0.0104375 0.5617448 -0.7636488 -0.0008899 0.0016869 -0.0114123 -0.2444833 -2.8771019 -0.2249689 -0.0844109 -0.6047503 -0.3558256 -0.0193146 -0.0978614 -0.0080669 -0.3281706 2.5800228 -0.1066146 0.0665241 -0.2439492 1.0990438 0.0232014 0.0612682 0.0273552 0.1934259 -3.1635847 0.041002 -0.0839758 -0.0778869 -0.5795324 -0.0109808 -0.0870927 -0.0075972 -0.3579157 -1.5595619 0.4823232 -0.0098637 0.6603725 -0.5481063 0.025863 -0.0083444 0.0217468 -0.7194712 -0.8179262 -0.140142 -0.008909 -0.5658951 -1.0639534 -0.0323186 -0.0242344 -0.0189622 -0.6327683 2.1808977 -0.0312728 0.0596938 -0.4509954 0.132539 -0.0138379 0.044139 -0.0013019 0.1369434 -0.8087547 -0.0351721 -0.0191534 -0.4212371 0.0785611 -0.0026622 -0.0323793 0.0087886 -0.207885 -0.6883861 0.0896475 -0.0127278 0.6207176 -0.1045045 0.0202476 0.0059687 0.004662 -0.1613264 -1.4172238 0.0979766 -0.0393045 0.1875432 -0.0872124 0.001735 -0.0355517 -0.0009794 0.0262078 0.5067619 -0.0358244 0.0164711 -0.3676847 0.0583581 -0.0056736 0.0050467 0.0040269 -0.0925677 0.6411122 -0.0571606 0.0198743 0.2035594 0.027024 0.0102172 0.0285549 0.0027298 -0.0987523 3.4475764 0.0991975 0.0994565 0.6119786 1.1532148 0.0502098 0.115741 0.0349778 0.2632084 3.1325473 -0.2016673 0.0803787 0.6457371 1.3962031 0.0605133 0.113513 0.0351081 0.2988865 0.0296002 0.0965586 -0.000606 0.0761558 -0.0580817 -0.0053068 -0.0013159 -0.0047477 0.1640116 0.1853706 -0.039434 -0.00088 -0.0315267 0.0670282 -0.0045822 -0.0006188 -0.0048919 0.175427 0.076749 -0.0699216 -0.005082 -0.0218206 0.0644837 -0.0041962 -0.0033955 -0.0056188 0.1690134 0.096922 0.0477245 -0.0003946 0.0124171 0.0394267 -0.0038909 -0.0016554 -0.0029056 0.1648081 0.2039525 -0.0167685 -0.0038683 -0.0596537 0.1586454 -0.0071969 -0.0046353 -0.0058717 0.3141731 0.2302659 -0.0409852 -0.0059932 -0.0255098 0.1533978 -0.009009 -0.002749 -0.0101169 0.3939674 0.2308416 -0.0408733 -0.006241 -0.1198878 0.2358715 -0.0095508 -0.0086094 -0.0074854 0.3942871 0.5606773 0.0727061 0.0085239 0.0511053 0.2639252 -0.0025133 0.0076731 -0.0019603 0.3620365 0.1108981 -0.0148171 -0.0104115 0.0088971 0.2185797 -0.0066546 -0.0105536 -0.0081781 0.3991722 unknown
polarizability: 321.5857901|-0.9299024|137.8166721|7.9878673|2.9156018|53.6197598 unknown
InChI: InChI=1S/C8H9N5O3/c9-7(10)12-8(14)11-5-1-3-6(4-2-5)13(15)16/h1-4,11H,9-10H2
charge 0 multiplicity 1
25 atoms
O  2.119993 1.394556 0.168803
O  -5.231246 -0.83573 -0.125894
O  -4.878905 1.419275 -0.039943
N  1.155277 -0.761348 0.062353
N  -4.4501 0.197304 -0.068427
N  3.437436 -0.619701 0.135333
N  5.749155 -0.766749 0.203208
N  4.765381 1.386758 0.251976
C  -0.21583 -0.468491 0.032287
C  -1.122953 -1.570523 -0.03154
C  -0.731156 0.862194 0.062215
C  -2.998233 -0.031773 -0.03398
C  -2.506928 -1.358515 -0.064682
C  -2.118021 1.073489 0.028951
C  2.254885 0.112883 0.12663
C  4.621978 0.024597 0.196533
H  -0.731483 -2.594572 -0.054926
H  -0.030597 1.697156 0.110992
H  -3.213958 -2.190446 -0.113515
H  -2.534366 2.084126 0.051106
H  1.438006 -1.744651 0.035807
H  6.691436 -0.388406 0.241957
H  5.604982 -1.772686 0.16188
H  3.872845 1.913717 0.243267
H  5.671203 1.847438 0.301208
