program: Gaussian 09
title: 000005842
version: EM64L-G09RevD.01
frameworkgroup: C1[X(C10H12N2O3)]
method: RPBEPBE
basis: SDD
operation: Freq
keyword: #p
keyword: freq=noraman
keyword: PBEPBE/SDD
title: #p freq=noraman PBEPBE/SDD
converged: YES YES NO NO
title: Mulliken charges:
elementType: O O O N N C C C C C C C C C C H H H H H H H H H H H H
charge: -0.213152 -0.208084 -0.220033 -0.374301 -0.379176 0.080122 -0.526121 -0.512277 0.177749 0.189979 -0.047001 0.001090 0.152868 -0.579028 -0.591034 0.238224 0.235995 0.224758 0.254907 0.368294 0.365692 0.241259 0.228798 0.218315 0.229744 0.224563 0.217851
chargesum: 0.00000
title: Mulliken charges with hydrogens summed into heavy atoms:
elementType: O O O N N C C C C C C C C C C
charge: -0.213152 -0.208084 -0.220033 -0.006007 -0.013484 0.080122 -0.051902 -0.032612 0.177749 0.189979 0.194258 0.229888 0.152868 -0.130969 -0.148620
polarizability: 1.46045840e+02 -4.92788255e+00 1.35001477e+02 1.07516412e+01 -5.79193064e+00 1.04319405e+02
1716.lowfreq: -5.9795 -0.0003 -0.0001 0.0005 7.0200 9.5685 28.8305 54.8814 68.5021
frequency: 28.7896 54.8411 68.4840 74.6880 92.6497 139.3682 142.5168 158.0697 178.5610 222.9271 249.9169 295.7546 344.9992 357.0877 366.2004 396.9944 432.6210 476.2064 483.9041 573.4628 621.3500 624.7343 635.4459 652.2739 687.4568 728.5072 755.9136 770.1191 787.3514 832.8294 888.9757 916.9855 951.3652 955.1125 959.9406 984.5084 991.5702 994.3368 1012.3122 1021.6204 1056.7134 1144.6195 1152.6585 1193.0153 1230.8795 1271.7946 1281.4420 1289.8652 1296.0962 1316.6351 1328.9568 1363.8424 1376.1428 1376.6499 1424.8673 1427.8331 1450.8191 1457.2939 1618.3836 1653.2747 1655.7391 1658.3671 1677.7595 2976.0400 3016.6988 3039.8604 3079.0481 3088.7301 3089.4887 3104.5641 3118.4739 3199.6099 3200.9073 3518.5885 3520.2529
redmass: 7.4259 3.0762 2.7989 3.7485 3.3752 3.8721 4.7453 9.3188 2.9349 3.2249 3.4237 3.6435 2.9219 8.4788 4.7422 2.7361 2.6508 2.4968 7.4606 3.5217 2.3397 2.7481 3.0755 2.5032 2.7410 3.3019 1.8306 3.2879 1.7350 2.1555 1.6251 2.1092 1.4132 1.8289 1.4268 3.0848 1.2252 2.9740 1.4806 1.5116 2.5887 2.3912 2.6083 3.2361 1.3158 1.4368 1.4650 1.3171 1.6347 1.3329 1.9249 9.0938 1.8245 1.6666 1.1538 1.1720 1.1199 1.1158 7.0651 8.5969 4.6838 4.6507 5.5022 1.0593 1.0586 1.1017 1.0948 1.0661 1.0624 1.0943 1.0933 1.1150 1.1142 1.0757 1.0782
irintensity: 0.7276 0.2946 0.3428 0.1141 1.2125 0.3674 0.2453 11.4584 0.9450 0.4520 2.1406 3.2755 4.2139 22.1446 12.3304 2.0099 4.3733 11.7863 13.1398 16.7283 2.1705 15.1642 17.6356 1.8026 27.7993 23.6968 3.2812 7.0431 196.0101 7.8343 0.3142 1.4255 74.2732 13.4632 76.1813 5.2379 6.9925 21.3559 8.8653 19.6908 3.6673 8.8444 18.6281 36.3523 11.2723 23.9633 57.6410 10.0459 89.7409 7.2349 169.8423 219.7355 5.2644 7.1837 11.0685 7.2219 31.0663 16.1884 298.6239 75.8501 12.6911 12.2625 597.4040 9.0691 13.1685 11.7932 0.7142 12.5174 6.7116 8.9856 8.6935 20.7904 20.7174 87.3792 40.9488
temp: 298.150 k
press: 1.00000 atm
elementType: 8 8 8 7 7 6 6 6 6 6 6 6 6 6 6 1 1 1 1 1 1 1 1 1 1 1 1
symmnumber: 1
zpe: 547690.3 jmol-1
zpe.correction: 0.208604 hartree
zpe.thermalcorrener: 0.223538 hartree
zpe.thermalcorrenthalpy: 0.224482 hartree
zpe.thermalcorrgfe: 0.165691 hartree
zpe.sumelectzpe: -722.326414 hartree
zpe.sumelectthermal: -722.311480 hartree
zpe.sumelectthermalent: -722.310536 hartree
zpe.sumelectthermalfe: -722.369327 hartree
dipole: -1.1094 -0.3165 0.5012
dipole: 1.2579
quadrupole: -86.7119 -95.4011 -93.5442
quadrupole: -4.3082 -4.0895 2.0625
quadrupole: 5.1738 -3.5154 -1.6584 -4.3082 -4.0895 2.0625
hfenergy: -722.5350181 hartree
pointgroup: C01 [X(C10H12N2O3)]
dipole: -0.0676972 -0.435399 -0.225286 debye
polarizability: 136.1815364|-6.444263|145.7644734|7.0812165|-7.4933446|103.4207126 unknown
InChI: InChI=1S/C10H12N2O3/c1-3-5-10(6-4-2)7(13)11-9(15)12-8(10)14/h3-4,11-12H,1-2,5-6H2
charge 0 multiplicity 1
27 atoms
O  -0.849797 1.38494 -2.018178
O  0.04636 -1.19389 1.972113
O  3.045416 2.005599 0.443916
N  1.083971 1.647133 -0.777646
N  1.572301 0.316754 1.114412
C  -0.437877 -0.280149 -0.258208
C  -1.968331 -0.319834 0.063111
C  -0.042002 -1.486264 -1.227093
C  -0.120933 0.984685 -1.075255
C  0.374183 -0.42223 1.036245
C  -2.406653 0.771797 1.02141
C  -0.168156 -2.86578 -0.622764
C  1.981222 1.363318 0.269112
C  -3.153057 1.84838 0.66895
C  0.824092 -3.790198 -0.638207
H  -2.19055 -1.306105 0.507828
H  -2.510005 -0.230943 -0.894713
H  0.991829 -1.337363 -1.59413
H  -0.71671 -1.381824 -2.100571
H  1.336105 2.443789 -1.372086
H  2.171432 0.145874 1.92902
H  -2.090009 0.648879 2.06791
H  -1.137289 -3.130854 -0.179383
H  -3.448234 2.605641 1.404302
H  -3.48399 2.002287 -0.36544
H  0.677902 -4.79158 -0.219477
H  1.810478 -3.573463 -1.067979
