program: Gaussian 09
title: 000005801
version: EM64L-G09RevD.01
frameworkgroup: C1[X(C6H7NO)]
method: RPBEPBE
basis: SDD
operation: Freq
keyword: #pfreq=noraman
keyword: PBEPBE/SDD
title: #p freq=noraman PBEPBE/SDD
converged: NO NO NO NO
title: Mulliken charges:
elementType: O N C C C C C C H H H H H H H
charge: -0.479783 -0.689983 0.327251 0.162130 -0.366846 -0.348403 -0.221884 -0.246178 0.216318 0.209915 0.218724 0.222169 0.300013 0.337552 0.359004
chargesum: 0.00000
title: Mulliken charges with hydrogens summed into heavy atoms:
elementType: O N C C C C C C
charge: -0.120780 -0.052418 0.327251 0.162130 -0.150528 -0.138488 -0.003160 -0.024009
polarizability: 9.94794030e+01 -3.37076125e+00 8.75694935e+01 -1.90290115e-03 -1.39920883e-03 3.15939675e+01
1716.lowfreq: -10.3554 -0.0012 -0.0011 -0.0005 5.8974 10.4677 178.2831 273.0916 300.1826
frequency: 178.2822 273.0915 300.1822 314.8917 344.7999 421.2521 435.0437 476.3079 525.5645 559.5411 571.9164 720.5133 730.7384 748.2214 822.3619 839.7590 888.9349 945.7222 1006.7458 1040.4022 1090.8477 1147.9436 1167.3325 1232.0398 1308.2594 1325.2860 1411.6798 1453.4284 1516.3716 1597.7461 1613.7006 1639.5651 3106.7953 3119.8097 3141.6445 3165.9707 3568.3939 3605.2155 3715.9669
redmass: 4.6656 2.7298 3.6860 1.1484 1.3047 3.5908 2.7381 1.0956 5.8108 3.9012 6.7326 3.7884 1.2380 5.0378 1.4770 5.4612 1.3748 1.2891 1.8573 1.8506 1.6653 1.2419 1.0492 2.2760 1.7600 1.8615 5.7109 2.8080 3.5192 4.5340 1.5218 3.5872 1.0888 1.0875 1.0920 1.0999 1.0443 1.0663 1.1047
irintensity: 0.0441 70.2638 13.7021 60.0357 277.9238 1.3955 13.6221 80.8037 2.8754 0.4042 0.0369 0.0007 120.5379 6.8458 1.6574 18.5111 5.4340 0.2446 1.6090 4.8526 216.8274 49.1523 1.3874 9.5510 57.0011 29.4851 3.0169 10.5723 124.6672 9.9599 34.5513 211.6378 19.7512 11.6425 25.0657 20.0460 75.7258 33.1986 33.8984
temp: 298.150 k
press: 1.00000 atm
elementType: 8 7 6 6 6 6 6 6 1 1 1 1 1 1 1
symmnumber: 1
zpe: 311461.3 jmol-1
zpe.correction: 0.118629 hartree
zpe.thermalcorrener: 0.125812 hartree
zpe.thermalcorrenthalpy: 0.126756 hartree
zpe.thermalcorrgfe: 0.087901 hartree
zpe.sumelectzpe: -362.227273 hartree
zpe.sumelectthermal: -362.220090 hartree
zpe.sumelectthermalent: -362.219146 hartree
zpe.sumelectthermalfe: -362.258001 hartree
dipole: 1.0179 0.3392 0.0030
dipole: 1.0729
quadrupole: -42.4461 -33.5247 -52.7408
quadrupole: -1.0830 0.0071 -0.0067
quadrupole: 0.4578 9.3792 -9.8369 -1.0830 0.0071 -0.0067
hfenergy: -362.345902 hartree
pointgroup: C01 [X(C6H7N1O1)]
dipole: 0.4007675 -0.1325506 -0.0012309 debye
dipolederiv: -0.9946626 0.601615 0.0000604 0.564947 -0.4728017 -0.0001237 0.0000398 -0.0001614 -0.4329616 -1.216742 -0.5373432 -0.0002043 -0.5552764 -0.3975076 -0.0004381 -0.0009522 -0.0008856 -0.7494318 1.1129214 0.6518366 0.0000317 0.8453618 0.1871612 0.0000451 -0.0001119 0.0000697 0.1165797 0.6543945 -0.5357292 -0.0001683 -0.9416272 0.2994483 0.0001021 0.0000816 0.0001277 -0.0079691 -0.2242091 -0.2945419 0.0000095 0.1284844 0.0990474 -0.000034 -0.0000606 0.000017 -0.231356 0.0380309 0.1095946 0.0000095 -0.0184562 0.0508892 0.0000017 0.0000002 -0.0000534 -0.1723064 0.0494582 0.13845 -0.0000297 -0.1008237 0.1282665 -0.0000172 -0.0000189 -0.0000452 -0.166025 -0.1365744 -0.0468285 -0.0000502 0.1165931 -0.1179061 -0.0000478 -0.0000479 -0.0000378 -0.2248857 0.0689773 -0.0424182 0.0000157 -0.0179725 -0.1429869 0.0000449 0.000013 0.0000263 0.1711954 0.0783558 0.0476697 0.000014 0.0222353 -0.1485179 0.0000373 -0.0000017 0.0000322 0.1681717 -0.0791088 0.0985444 0.0000299 0.1072325 0.0246152 0.0000022 0.0000349 0.0000151 0.1646975 -0.0847007 -0.0857669 0.0000655 -0.0930384 0.0302249 0.0000392 0.0000646 0.0000497 0.1778686 0.1797596 0.0382149 0.0000238 0.0570109 0.145675 0.0002554 0.0004344 0.0006201 0.3922201 0.2491478 0.0261647 0.0001396 -0.0151346 0.1782412 0.0000642 0.0004884 0.0001444 0.4000831 0.3049522 -0.1694619 0.0000529 -0.099536 0.1361514 0.0000686 0.0000365 0.0000813 0.3941195 unknown
polarizability: 99.4641976|3.3974796|87.5846962|-0.0103868|-0.0085828|31.5939702 unknown
InChI: InChI=1S/C6H7NO/c7-5-3-1-2-4-6(5)8/h1-4,8H,7H2
charge 0 multiplicity 1
15 atoms
O  1.825023 -1.357014 -0.00034
N  1.870507 1.32908 -0.000347
C  0.622604 0.712756 -0.000299
C  0.561005 -0.714642 -0.000127
C  -0.604086 1.429301 -0.000195
C  -0.668344 -1.39597 0.000194
C  -1.841555 0.746439 0.000089
C  -1.883226 -0.666039 0.000306
H  -0.578962 2.52607 -0.000298
H  -0.683163 -2.494663 0.000336
H  -2.773793 1.322063 0.000163
H  -2.840233 -1.197169 0.000567
H  1.955376 2.340027 -0.001664
H  2.705974 0.750601 -0.000929
H  1.721972 -2.339339 -0.000157
