program: Gaussian 09
title: 000038384
version: EM64L-G09RevD.01
frameworkgroup: C1[X(C7H6BrNO)]
method: RPBEPBE
basis: SDD
operation: Freq
keyword: #p
keyword: freq=noraman
keyword: PBEPBE/SDD
title: #p freq=noraman PBEPBE/SDD
converged: YES YES NO NO
title: Mulliken charges:
elementType: Br O N C C C C C C C H H H H H H
charge: 0.009143 -0.174479 -0.028878 0.029133 0.249798 -0.253426 -0.181726 -0.775355 -0.156661 -0.357563 0.283891 0.308229 0.308138 0.250250 0.239643 0.249862
chargesum: 0.00000
title: Mulliken charges with hydrogens summed into heavy atoms:
elementType: Br O N C C C C C C C
charge: 0.009143 -0.174479 -0.028878 0.029133 0.249798 0.030465 0.068524 -0.158988 0.082983 -0.107701
polarizability: 1.54058405e+02 -9.69819766e+00 9.37545311e+01 -3.97576346e-03 -1.66337687e-02 4.02558397e+01
1716.lowfreq: 0.0004 0.0006 0.0007 1.2041 9.7914 13.5080 36.8088 68.8968 113.7662
frequency: 36.7226 68.8153 113.7385 151.9186 180.4143 290.4726 384.6673 416.3446 451.6931 559.6906 606.5402 619.1498 690.2835 746.5077 773.4363 778.9195 876.4850 920.4216 966.7812 976.0480 993.7342 1017.0649 1036.9347 1085.6055 1117.5202 1162.1098 1199.7956 1273.9263 1281.7825 1328.3982 1396.2577 1415.8136 1445.7574 1562.2385 1570.4533 1623.5923 3056.8890 3127.2340 3137.6688 3149.5696 3168.4991 3179.2139
redmass: 5.2597 3.2131 6.8586 4.7702 15.5089 7.6343 2.9076 3.8892 8.5813 2.2496 8.0275 6.8053 6.1621 2.5453 6.8566 1.4284 2.0199 1.3227 6.9757 1.4474 4.0403 1.3490 2.1397 1.6196 1.1561 1.0869 1.6776 2.4481 1.6176 6.9774 1.1046 1.9783 2.2018 5.9477 5.7097 10.3051 1.0580 1.1044 1.0884 1.0906 1.0950 1.1008
irintensity: 0.1196 11.5479 2.3842 1.3895 1.7071 7.8734 3.4076 1.1390 2.7480 3.7464 51.5768 25.4466 15.4562 12.9719 0.0569 77.4317 1.6431 0.0391 8.2055 1.1938 58.0087 0.2784 2.8417 8.5853 1.5978 2.8912 63.3561 53.3909 0.6461 3.3064 36.5140 17.9443 7.2456 15.9108 9.7747 68.2682 18.6550 0.0114 7.2078 11.5672 9.1615 17.2907
temp: 298.150 k
press: 1.00000 atm
elementType: 35 8 7 6 6 6 6 6 6 6 1 1 1 1 1 1
symmnumber: 1
zpe: 298702.2 jmol-1
zpe.correction: 0.113770 hartree
zpe.thermalcorrener: 0.122835 hartree
zpe.thermalcorrenthalpy: 0.123779 hartree
zpe.thermalcorrgfe: 0.077055 hartree
zpe.sumelectzpe: -413.049683 hartree
zpe.sumelectthermal: -413.040618 hartree
zpe.sumelectthermalent: -413.039674 hartree
zpe.sumelectthermalfe: -413.086398 hartree
dipole: 5.8815 -1.5183 0.0007
dipole: 6.0743
quadrupole: -53.5645 -67.5025 -68.3254
quadrupole: 2.8110 -0.0094 -0.0060
quadrupole: 9.5663 -4.3717 -5.1946 2.8110 -0.0094 -0.0060
hfenergy: -413.1634525 hartree
pointgroup: C01 [X(C7H6Br1N1O1)]
dipole: -2.3529614 -0.4181414 0.0031294 debye
dipolederiv: -0.5110366 0.0446162 0.0012243 -0.0436958 -0.0657969 0.0003962 0.0002034 0.000312 -0.1093678 -0.6817086 -0.0856638 0.0007263 -0.1436796 -0.7262521 -0.0028262 0.0003119 -0.0031153 -0.2777895 -0.3248828 -0.033476 0.0001343 0.1292187 -0.3347522 -0.0015551 0.0013322 -0.0011141 -0.191721 -0.3261115 0.0560999 0.0015452 -0.053641 0.0179916 0.0003167 0.00066 -0.0001044 0.0217741 1.3155169 -0.0164519 -0.0042683 -0.396075 0.8921367 0.0067506 -0.0076214 0.0059777 0.1273616 -0.25921 0.0890308 0.001301 0.0127119 0.0149927 0.0004519 0.0008377 0.0002635 -0.0559313 0.1428894 -0.1255837 -0.0018815 -0.0861594 0.1104639 0.0021037 -0.001562 0.002233 -0.1222878 0.6883738 0.1150131 -0.0000268 0.5309773 -0.3233879 -0.004518 0.0043293 -0.0036508 0.0594041 0.0889101 0.1040792 0.0001743 -0.1078861 -0.1896464 -0.0004554 -0.0013873 -0.0011914 -0.0858406 -0.0782123 -0.0083303 -0.0000097 0.2913294 0.3754443 0.0025869 0.0023295 0.0035844 -0.0736946 0.1308397 -0.0574924 -0.0003254 -0.0278168 0.0182411 -0.0010245 -0.0000868 -0.0009187 0.1628261 -0.0670842 -0.0361201 0.0614373 -0.0352885 0.09417 0.0449542 0.0395034 0.0477632 0.0484456 -0.0676045 -0.0351058 -0.0616204 -0.0347649 0.0957377 -0.043958 -0.0402071 -0.0467449 0.0470949 -0.0009171 0.0867566 0.0011761 0.0963133 0.0001825 -0.0014951 0.0012361 -0.0014563 0.1507425 -0.0912326 -0.045137 0.0005021 -0.0342646 0.0944551 -0.0003911 0.000571 -0.0003757 0.1607553 0.0414705 -0.0522351 -0.0000887 -0.0972789 -0.0739802 -0.0013366 -0.0004498 -0.0014623 0.1382285 unknown
polarizability: 155.1859899|4.975166|92.6230938|-0.2846263|0.3931968|40.2596921 unknown
InChI: InChI=1S/C7H6BrNO/c8-5-7(10)6-3-1-2-4-9-6/h1-4H,5H2
charge 0 multiplicity 1
16 atoms
Br 4.121234 -0.524077 -0.017828
O  1.776509 1.552356 0.002147
N  -0.6085 -1.154339 -0.010816
C  -0.184983 0.150287 -0.002134
C  1.308196 0.386561 -0.005225
C  -1.073966 1.254083 0.009347
C  -2.461957 1.000228 0.012097
C  2.154774 -0.886391 -0.017785
C  -2.910692 -0.341411 0.00322
C  -1.950554 -1.38234 -0.008107
H  -0.659825 2.266461 0.015774
H  1.936733 -1.505023 0.866626
H  1.934052 -1.488989 -0.912614
H  -3.178926 1.827457 0.020951
H  -3.978337 -0.581942 0.00501
H  -2.260857 -2.433021 -0.015262
