program: Gaussian 09
title: 000038385
version: EM64L-G09RevD.01
frameworkgroup: C1[X(C12H6Br4)]
method: RPBEPBE
basis: SDD
operation: Freq
keyword: #pfreq=noraman
keyword: PBEPBE/SDD
title: #p freq=noraman PBEPBE/SDD
converged: YES YES NO NO
title: Mulliken charges:
elementType: Br Br Br Br C C C C C C C C C C C C H H H H H H
charge: 0.079280 0.057192 0.064341 0.066798 0.330738 0.417135 -0.345677 -0.371774 -0.391158 -0.372875 -0.157456 -0.168224 -0.162681 -0.224743 -0.196018 -0.199542 0.275271 0.273165 0.261341 0.259621 0.243071 0.262193
chargesum: 0.00000
title: Mulliken charges with hydrogens summed into heavy atoms:
elementType: Br Br Br Br C C C C C C C C C C C C
charge: 0.079280 0.057192 0.064341 0.066798 0.330738 0.417135 -0.070406 -0.098608 -0.391158 -0.111534 -0.157456 0.091397 -0.162681 0.018328 -0.196018 0.062652
polarizability: 3.06978041e+02 9.76376035e+00 1.88343345e+02 6.83246170e+00 7.39393279e+00 1.06346043e+02
1716.lowfreq: -5.2576 -3.5249 -2.1905 -0.0004 -0.0004 -0.0002 22.8999 27.6534 35.5408
frequency: 22.8839 27.6527 35.5309 90.0367 112.4895 121.9840 133.7214 150.5155 171.6176 188.0434 222.6266 251.6427 307.8091 325.0941 352.8502 375.2502 416.7025 438.1231 460.1143 500.2390 561.5280 596.9379 641.0253 665.8854 684.3114 704.1201 725.3049 787.9742 797.1175 829.1489 889.7711 912.8303 962.6753 979.0160 980.5863 996.9136 1040.0517 1101.2770 1107.6870 1135.1593 1151.2441 1198.1504 1249.0673 1288.2960 1329.6284 1346.2093 1369.1912 1389.9265 1422.9893 1460.7469 1540.5804 1552.4018 1581.3496 1588.5747 3143.8785 3156.4486 3159.1496 3161.4799 3176.5756 3179.7126
redmass: 12.4302 37.1310 17.0036 9.4354 11.4395 10.6645 39.8892 9.4012 15.7796 5.0988 8.3673 9.6109 7.5209 9.5506 8.6757 5.6565 5.6928 4.0137 5.3966 4.0292 5.3307 5.3605 7.4894 8.0517 7.4793 3.8817 3.0290 1.8999 3.4653 1.3714 1.4221 1.3915 1.3500 1.5070 4.9010 6.1829 5.4961 2.5096 1.6877 1.9411 1.4258 1.2784 1.3367 2.3875 3.7356 7.9459 4.2871 2.7905 2.1405 3.2758 6.6910 6.9012 6.7808 6.5685 1.0874 1.0885 1.0922 1.0928 1.0975 1.0990
irintensity: 0.3544 0.0080 0.1989 0.2617 0.2555 0.4054 0.0673 0.1551 0.1690 0.7190 1.8704 2.2523 5.0628 6.5406 2.4389 1.1984 4.3596 13.2821 3.3963 0.3894 0.7538 5.8869 3.8223 31.2210 31.3523 5.5941 16.4020 86.3257 8.8147 19.2899 8.8909 1.8556 0.6208 1.0824 18.3114 64.4614 30.4798 27.8681 12.7946 19.0802 0.7629 3.0252 2.4464 7.7134 14.6611 4.9517 21.6977 31.0547 115.8824 25.3163 40.3470 11.1908 13.8692 7.1241 4.6558 1.7976 2.3243 4.6482 2.7191 7.2115
temp: 298.150 k
press: 1.00000 atm
elementType: 35 35 35 35 6 6 6 6 6 6 6 6 6 6 6 6 1 1 1 1 1 1
symmnumber: 1
zpe: 360374.1 jmol-1
zpe.correction: 0.137259 hartree
zpe.thermalcorrener: 0.152611 hartree
zpe.thermalcorrenthalpy: 0.153555 hartree
zpe.thermalcorrgfe: 0.089595 hartree
zpe.sumelectzpe: -513.601493 hartree
zpe.sumelectthermal: -513.586141 hartree
zpe.sumelectthermalent: -513.585197 hartree
zpe.sumelectthermalfe: -513.649158 hartree
dipole: 1.3760 1.6008 1.9529
dipole: 2.8757
quadrupole: -136.4460 -117.6793 -129.5110
quadrupole: 7.3956 2.4790 1.5195
quadrupole: -8.5672 10.1994 -1.6322 7.3956 2.4790 1.5195
hfenergy: -513.7387526 hartree
pointgroup: C01 [X(C12H6Br4)]
dipole: 0.6844278 0.8832991 0.1771476 debye
dipolederiv: -0.050889 -0.1733577 0.0415724 -0.1283825 -0.4683875 0.134879 0.0470254 0.1360048 -0.0201788 -0.2200771 0.065281 -0.25316 0.0880632 -0.0250762 0.1071139 -0.3564443 0.1073344 -0.4320004 -0.4582368 0.2962122 -0.0923442 0.3675861 -0.2276472 0.0689446 -0.1084374 0.0654454 -0.021301 -0.7278449 -0.0513094 0.1168 -0.07667 0.0020256 0.0120141 0.1416138 0.0085963 -0.01311 0.259843 -0.03224 0.0052626 0.0849371 -0.0267893 -0.0303148 0.0036381 0.0166802 0.0701887 0.3902732 -0.0606019 -0.0008912 -0.080236 -0.1918686 0.0835866 -0.055504 0.0502979 -0.0371848 -0.2046651 0.0468363 -0.1921669 -0.0399961 -0.0821946 0.0426722 -0.0829945 0.0314839 -0.1896858 -0.1141207 0.0039552 0.0528925 0.0209237 -0.077027 -0.05258 -0.0549744 -0.0214584 0.0114356 -0.2254061 0.3260412 -0.0835565 0.4576742 0.7328746 -0.211408 -0.0958846 -0.2313995 -0.0349873 -0.1999907 0.0274542 -0.0231678 -0.086308 -0.0015222 -0.0260147 -0.0030425 -0.031512 -0.1200819 0.044213 -0.1701729 0.6796012 -0.127884 -0.031026 -0.1936451 0.6117696 -0.2227183 0.748665 -0.3121923 -0.0218874 0.0452662 -0.0261054 -0.0699674 -0.028295 -0.0234781 -0.0362504 0.027691 0.6802157 -0.4961437 0.1478098 -0.8775945 0.2385914 -0.1113326 0.2429102 -0.1011238 -0.0438699 0.0719956 -0.0279796 0.0021349 0.0697489 0.0567894 -0.0713069 0.023798 -0.0639017 -0.1105268 1.1223003 0.1694196 -0.4359879 0.1356868 -0.0963335 -0.0025308 -0.2516088 0.0261053 -0.1831105 -0.2129817 0.1112694 -0.0406707 0.2220215 -0.1724726 0.0218184 -0.0626369 0.022596 -0.0997262 0.0717651 -0.0307137 0.0645142 -0.0217735 0.1255944 0.0385146 0.0717206 0.0242765 0.0233503 0.0314596 0.0036289 -0.0738995 0.0100084 0.1220203 0.0373893 -0.0881328 0.0298849 0.0214073 0.0215818 0.0839994 -0.0199993 0.1053095 0.0171174 0.033113 -0.026565 0.0423986 0.1268117 0.0415148 -0.0082524 0.0329327 -0.0205682 0.1397009 0.0501167 0.0457815 0.0441809 -0.0110859 0.0343477 -0.0344538 0.0131177 -0.0523361 -0.0535624 0.0736883 0.0186611 0.0730323 0.1363787 -0.0431056 -0.0269849 0.0139399 -0.0241051 0.0891606 0.0235772 0.002785 0.030047 0.1509211 unknown
polarizability: 306.1748525|-9.3655221|154.5893757|11.7076483|-41.6376653|140.9032005 unknown
InChI: InChI=1S/C12H6Br4/c13-9-5-4-7(6-11(9)15)8-2-1-3-10(14)12(8)16/h1-6H
charge 0 multiplicity 1
22 atoms
Br 1.401562 -2.402053 0.881401
Br -3.809072 0.720522 -2.348596
Br 4.744012 -1.639432 0.607599
Br -5.227114 -0.207938 0.717154
C  -0.474541 0.194314 0.213365
C  1.000895 0.392337 0.063575
C  -1.324652 0.459629 -0.888947
C  -1.061548 -0.179148 1.449919
C  1.975422 -0.606544 0.362034
C  1.457878 1.655997 -0.400062
C  -2.727133 0.344623 -0.767692
C  -2.459302 -0.290394 1.574659
C  3.355944 -0.319076 0.217501
C  2.830435 1.934034 -0.548261
C  -3.301293 -0.031889 0.467677
C  3.787418 0.948568 -0.231619
H  -0.89268 0.737621 -1.854998
H  -0.429581 -0.372951 2.321219
H  0.714117 2.429234 -0.618908
H  -2.905075 -0.572583 2.532465
H  3.159907 2.916606 -0.899707
H  4.856901 1.151323 -0.333579
