program: Gaussian 09
title: 000038404
version: EM64L-G09RevD.01
frameworkgroup: C1[X(C20H23Br2N3O3)]
method: RPBEPBE
basis: SDD
operation: Freq
keyword: #p
keyword: freq=noraman
keyword: PBEPBE/SDD
title: #p freq=noraman PBEPBE/SDD
converged: YES YES NO NO
title: Mulliken charges:
elementType: Br Br O O O N N N C C C C C C C C C C C C C C C C C C C C H H H H H H H H H H H H H H H H H H H H H H H
charge: -0.034393 -0.033377 -0.270694 -0.435078 -0.237950 -0.150836 -0.072266 -0.131397 -0.399199 -0.400954 0.472555 -0.440773 -0.440619 -0.512394 -0.345119 -0.638159 -0.638010 0.227786 -0.292586 0.018033 -0.512370 0.069736 0.229836 -0.349824 -0.314431 -0.209081 -0.237804 0.092252 0.255447 0.253091 0.253061 0.258668 0.319523 0.322635 0.268898 0.243482 0.241264 0.251388 0.232803 0.239923 0.251942 0.231895 0.279697 0.216719 0.250946 0.253121 0.254365 0.263718 0.234445 0.235203 0.374887
chargesum: 0.00000
title: Mulliken charges with hydrogens summed into heavy atoms:
elementType: Br Br O O O N N N C C C C C C C C C C C C C C C C C C C C
charge: -0.034393 -0.033377 -0.270694 -0.060192 -0.237950 -0.150836 -0.072266 -0.131397 0.109338 0.110774 0.472555 -0.121250 -0.117983 -0.243497 -0.101637 0.087295 0.085749 0.227786 -0.012889 0.018033 0.208416 0.069736 0.229836 -0.095459 -0.050713 0.025364 -0.002601 0.092252
polarizability: 6.02369688e+02 3.02996138e+01 3.36843109e+02 -1.23856093e+01 1.83181378e+01 1.72493420e+02
1716.lowfreq: -2.3161 -0.0004 -0.0003 0.0002 3.2324 5.2285 16.7409 16.8914 22.5028
frequency: 16.7159 16.8474 22.4885 23.9189 34.5272 40.2034 46.5170 52.8582 58.0209 79.1208 93.3266 107.1443 111.4359 130.0781 148.0713 176.9961 183.0639 197.5592 210.7250 214.4171 217.8153 233.1551 244.7713 250.6558 257.6033 280.0210 281.6779 288.2614 306.9093 320.1000 343.3096 357.3334 381.5332 386.8075 417.4923 437.5718 439.7805 467.8972 494.3895 506.6823 517.7937 530.4374 554.5827 577.0454 591.6080 596.7662 603.4812 622.5246 648.8301 662.9794 683.3365 689.5777 724.1271 731.1902 763.6772 775.1833 798.4036 811.8970 848.8816 851.4722 865.1283 866.8134 880.5878 896.7882 905.0532 920.1322 965.1356 972.0888 977.0031 983.4896 993.0745 995.6678 998.1156 1010.5926 1036.5380 1066.4385 1103.7741 1113.4391 1118.9662 1123.4753 1127.7119 1135.1122 1152.0985 1157.7215 1170.1118 1172.5011 1181.6360 1186.3936 1206.0308 1213.0614 1238.6143 1252.1969 1263.4972 1272.2699 1283.4494 1295.0336 1331.7629 1335.6352 1340.9970 1349.8897 1351.0225 1375.7214 1380.4892 1391.0857 1392.9701 1397.0473 1424.7818 1437.5044 1449.3628 1457.4190 1459.4166 1461.2809 1462.1790 1463.3639 1472.6938 1473.0105 1478.2773 1488.5996 1503.9375 1537.4756 1560.2388 1599.5952 1620.9092 1637.8011 2981.9081 2982.8922 2996.9018 3014.0838 3018.8360 3067.3522 3068.4694 3075.8119 3079.5740 3088.2073 3090.8461 3108.3366 3109.5855 3109.8899 3128.1485 3136.5694 3151.8674 3152.0246 3165.3999 3170.9462 3175.7370 3176.9194 3513.1179
redmass: 7.2619 7.5945 12.0746 11.0386 4.8752 4.2436 6.0703 4.3440 4.3522 6.0240 4.1155 5.0386 8.2971 7.6726 7.6866 4.2069 4.9122 3.2885 2.9076 5.3425 3.4517 2.8358 1.1549 1.4309 1.5511 2.7921 2.5557 5.3695 4.5967 4.0067 4.0490 6.4113 4.2807 4.4819 3.0841 3.4970 2.9903 3.8493 3.5427 4.3445 4.2934 3.1870 3.6093 4.3508 2.1442 4.0174 2.1539 4.4040 4.9286 4.3234 4.3058 5.1382 4.3809 3.4471 3.5946 1.4776 4.9715 1.5644 4.1878 1.6796 2.9658 3.2051 2.2083 2.6455 1.3906 1.4908 1.4891 2.4643 1.5599 4.5649 1.3439 1.3957 1.4166 2.6219 2.3332 1.8522 2.4060 1.8486 1.2625 2.1815 2.4562 2.1970 1.7267 1.4302 1.8086 1.1304 1.7410 1.6909 1.6223 1.9248 1.8072 2.1187 1.3364 1.8433 1.6658 2.3709 1.3113 2.0350 1.3625 2.6065 1.3175 1.8551 9.1576 1.2640 1.2245 2.8125 2.2268 2.4818 1.1486 1.4602 2.3838 1.0618 1.0517 1.1369 1.0605 1.0569 1.1003 2.2694 1.2723 6.4217 6.3111 6.3906 6.5819 8.6269 1.0377 1.0377 1.0288 1.0611 1.0623 1.0931 1.0923 1.1002 1.0968 1.0951 1.0976 1.0995 1.0991 1.1042 1.1059 1.0859 1.0901 1.0865 1.0946 1.0952 1.1000 1.0912 1.0639
irintensity: 0.1480 0.0269 0.2624 0.6504 0.2595 0.7561 0.2328 0.4901 2.7651 4.0320 4.8829 0.7088 0.1872 0.7745 1.0039 1.4883 1.4744 0.3843 1.8038 2.8140 6.8350 0.9119 0.4064 2.4319 0.5116 1.4149 2.9459 1.0643 2.2447 5.5935 4.5254 4.8629 3.1631 3.2789 11.0160 6.0001 4.9250 8.6453 19.9514 14.4589 3.0056 1.8501 9.7894 52.7908 59.5448 43.0004 31.5734 12.5533 23.9728 10.5496 55.8059 8.4532 20.5784 2.3567 31.3275 59.4402 1.1272 31.9020 36.6531 36.8110 3.4032 3.4814 13.6809 4.3040 7.5073 19.2234 37.6906 1.4465 9.3647 240.3936 3.2045 50.8199 39.0265 10.9816 18.5440 112.9094 45.5305 92.6676 7.1765 8.9810 19.2284 20.5289 117.9041 24.1862 20.6216 4.2977 105.1780 102.0834 48.3978 126.4926 351.2893 6.5847 2.5556 27.9932 76.6198 75.7366 130.6861 543.3476 35.2238 45.5985 6.4750 44.1940 27.8060 19.4848 23.0921 26.6005 7.1685 3.2272 19.0549 23.8913 44.2443 22.1426 4.3824 22.8282 0.7675 10.5185 13.7194 97.0971 89.8991 90.9360 39.1687 11.2084 829.4674 187.2129 11.2839 14.4156 34.1964 25.4343 34.1656 0.5591 10.6209 12.6247 17.4237 3.3631 34.7578 28.3745 13.3436 23.1875 25.9525 3.5788 10.9913 4.6837 10.2082 13.7342 35.7607 15.5124 29.5015
temp: 298.150 k
press: 1.00000 atm
elementType: 35 35 8 8 8 7 7 7 6 6 6 6 6 6 6 6 6 6 6 6 6 6 6 6 6 6 6 6 1 1 1 1 1 1 1 1 1 1 1 1 1 1 1 1 1 1 1 1 1 1 1
symmnumber: 1
zpe: 1039311.0 jmol-1
zpe.correction: 0.395853 hartree
zpe.thermalcorrener: 0.424967 hartree
zpe.thermalcorrenthalpy: 0.425911 hartree
zpe.thermalcorrgfe: 0.330625 hartree
zpe.sumelectzpe: -1190.662811 hartree
zpe.sumelectthermal: -1190.633696 hartree
zpe.sumelectthermalent: -1190.632752 hartree
zpe.sumelectthermalfe: -1190.728038 hartree
dipole: -0.0449 0.1860 -0.7019
dipole: 0.7275
quadrupole: -163.8761 -188.5369 -187.9853
quadrupole: -1.2395 -4.5049 -6.1051
quadrupole: 16.2566 -8.4041 -7.8525 -1.2395 -4.5049 -6.1051
hfenergy: -1191.0586633 hartree
pointgroup: C01 [X(C20H23Br2N3O3)]
dipole: 0.0157954 0.0979695 -0.2684681 debye
polarizability: 605.0561602|-11.7630497|298.6622924|16.7476278|68.8905381|207.987765 unknown
InChI: InChI=1S/C20H23Br2N3O3/c1-13(21)11-25(12-14(2)22)15-8-9-18(19(10-15)28-3)24-23-17-7-5-4-6-16(17)20(26)27/h4-10,13-14,26H,11-12H2,1-3H3
charge 0 multiplicity 1
51 atoms
Br 4.953029 -3.892025 -2.267481
Br 5.982834 2.74059 1.831229
O  0.112263 2.651246 0.437025
O  -4.609576 2.430139 1.946162
O  -3.229652 0.647405 2.483252
N  3.791181 -0.353991 -0.154038
N  -1.857251 0.461444 -0.076232
N  -2.587645 -0.57282 -0.431467
C  4.369828 -1.672338 -0.486287
C  4.716404 0.764425 0.120893
C  2.39791 -0.161365 -0.116572
C  4.323319 -1.951421 -2.010109
C  4.856039 1.031686 1.641393
C  1.836352 1.11501 0.142814
C  1.492165 -1.262776 -0.325921
C  5.187374 -1.02413 -2.865482
C  5.514327 -0.095722 2.437527
C  0.437104 1.326867 0.182221
C  0.118265 -1.056112 -0.288907
C  -0.465502 0.230683 -0.056293
C  -1.237041 3.077629 0.857201
C  -3.991585 -0.359568 -0.390696
C  -4.694589 0.521376 0.499193
C  -4.730452 -1.105366 -1.34964
C  -6.09487 0.689883 0.332881
C  -6.12052 -0.937814 -1.488211
C  -6.80669 -0.022284 -0.653908
C  -4.06375 1.149683 1.6935
H  3.847204 -2.479047 0.05762
H  5.42122 -1.693401 -0.15264
H  5.710223 0.517053 -0.289622
H  4.377228 1.682916 -0.390671
H  3.283115 -1.982177 -2.372248
H  3.889343 1.325901 2.080407
H  2.451875 1.997011 0.333354
H  1.86829 -2.272913 -0.507669
H  4.829088 0.017491 -2.752193
H  5.117327 -1.292017 -3.932438
H  6.249089 -1.069993 -2.565658
H  4.890752 -1.007775 2.363475
H  5.598508 0.170703 3.503784
H  6.525399 -0.322886 2.055828
H  -0.574796 -1.886682 -0.454066
H  -1.098087 4.127222 1.161018
H  -1.956292 2.992093 0.028633
H  -1.586232 2.459383 1.701462
H  -4.172063 -1.790284 -1.99548
H  -6.620839 1.373347 1.005995
H  -6.66653 -1.511275 -2.24496
H  -7.887341 0.119988 -0.757122
H  -4.241352 2.756608 2.811843
