program: Gaussian 09
title: 000038376
version: EM64L-G09RevD.01
frameworkgroup: C1[X(C15H13NO4)]
method: RPBEPBE
basis: SDD
operation: Freq
keyword: #p
keyword: freq=noraman
keyword: PBEPBE/SDD
title: #p freq=noraman PBEPBE/SDD
converged: NO YES NO NO
title: Mulliken charges:
elementType: O O O O N C C C C C C C C C C C C C C C H H H H H H H H H H H H H
charge: -0.180090 -0.179156 -0.441844 -0.252631 -0.354638 0.135613 0.135550 -0.493762 -0.493754 -0.416079 -0.416026 0.064522 0.064450 0.493554 -0.344336 -0.341568 -0.363552 -0.333787 0.264722 0.107392 0.239032 0.253221 0.239259 0.253338 0.220216 0.214101 0.220309 0.213960 0.280961 0.279781 0.272210 0.274926 0.384106
chargesum: 0.00000
title: Mulliken charges with hydrogens summed into heavy atoms:
elementType: O O O O N C C C C C C C C C C C C C C C
charge: -0.180090 -0.179156 -0.057738 -0.252631 -0.354638 0.135613 0.135550 -0.001510 -0.001157 0.018239 0.018243 0.064522 0.064450 0.493554 -0.063375 -0.061787 -0.091342 -0.058861 0.264722 0.107392
polarizability: 2.92477687e+02 -1.27951575e+00 1.84086606e+02 6.57009811e-01 -7.34853486e+00 9.36917768e+01
1716.lowfreq: -2.8380 -0.0006 0.0004 0.0006 5.4782 13.2822 33.5271 34.6972 63.0318
frequency: 33.4269 34.5150 63.0314 76.9413 101.5200 113.4069 118.9927 164.5503 195.5662 210.0949 239.0994 260.3759 274.9147 312.2322 333.4731 365.0514 405.0185 410.1018 435.1328 450.6441 488.8752 505.6187 516.1844 545.5018 591.2488 601.7106 625.5852 629.2699 684.2981 704.3560 725.0565 730.8780 737.1563 764.0334 801.1129 817.5263 843.7369 857.6113 858.9558 864.2909 896.8179 954.1143 983.3342 991.0894 1000.0695 1014.5864 1024.7797 1050.3461 1078.4585 1079.0915 1098.8356 1123.7334 1134.3046 1152.4724 1165.6095 1206.0542 1228.2408 1228.6423 1231.7588 1266.4969 1315.0164 1323.4197 1330.8434 1335.6933 1338.9179 1353.0342 1380.1163 1385.7504 1424.4571 1445.7306 1450.5820 1470.6113 1472.0054 1507.2160 1572.4599 1616.9054 1619.7477 1641.0807 1669.1349 1678.1981 2973.4773 2973.6832 2989.1015 2992.2412 3031.4848 3033.0144 3055.7705 3062.3224 3159.4105 3173.5005 3197.4017 3200.3615 3528.9339
redmass: 5.6928 6.0936 6.2088 5.8960 3.4372 3.6918 6.3511 6.8743 5.8840 7.5992 5.3150 3.4021 1.8765 5.8106 6.2163 6.2331 3.2638 4.4159 3.7502 2.9369 6.1111 3.0905 6.7590 2.9123 1.2349 6.1016 5.8601 6.9283 3.4693 5.9076 5.0432 4.4583 5.2844 4.5875 5.2733 1.7161 1.2613 2.5043 1.9423 2.5060 1.5485 2.6920 1.3958 1.3900 4.6535 5.2008 3.7041 3.3395 1.9666 4.0257 1.8521 1.1531 1.3484 1.6540 1.4729 1.1893 1.4749 1.6220 2.7695 1.2680 1.4099 2.4081 1.3666 7.0251 1.4898 1.6651 6.8177 3.2204 3.5011 1.1094 1.0735 1.0907 1.0875 2.6591 7.6559 12.1752 6.2289 8.6115 11.7972 8.8538 1.0651 1.0652 1.0662 1.0610 1.0929 1.0940 1.0983 1.1040 1.0909 1.0901 1.0945 1.0961 1.0641
irintensity: 1.5585 0.3780 0.9191 0.9416 0.8527 0.1433 4.1349 1.7404 1.1461 0.1256 0.3429 2.8889 1.1020 1.4327 9.3605 0.7356 3.5980 25.6725 5.9479 4.4725 9.8388 41.1621 12.1556 0.2264 77.6306 8.4773 12.8048 1.1578 68.1005 18.6058 31.9807 19.3573 0.2451 13.1718 12.4568 3.3609 1.3695 0.3969 40.1328 27.7116 3.0082 15.0831 4.1504 2.4117 171.5952 19.2808 198.7547 10.3835 0.1273 1.0897 3.6670 1.6708 15.8503 158.7788 33.3476 2.9035 4.6158 7.7535 69.1953 6.9965 16.9086 75.2202 3.0463 787.9490 3.7715 0.4647 6.0339 2.6751 31.5754 1.4584 37.0130 12.2345 8.8103 137.5749 33.4178 358.9496 171.7261 338.7416 42.2071 27.8486 14.2780 2.5909 30.7532 30.7743 24.1973 2.4558 57.1313 45.2563 0.7362 0.5028 0.3890 0.2851 52.4910
temp: 298.150 k
press: 1.00000 atm
elementType: 8 8 8 8 7 6 6 6 6 6 6 6 6 6 6 6 6 6 6 6 1 1 1 1 1 1 1 1 1 1 1 1 1
symmnumber: 1
zpe: 658553.5 jmol-1
zpe.correction: 0.250830 hartree
zpe.thermalcorrener: 0.267735 hartree
zpe.thermalcorrenthalpy: 0.268679 hartree
zpe.thermalcorrgfe: 0.205221 hartree
zpe.sumelectzpe: -933.663268 hartree
zpe.sumelectthermal: -933.646363 hartree
zpe.sumelectthermalent: -933.645418 hartree
zpe.sumelectthermalfe: -933.708877 hartree
dipole: 5.4738 -1.2730 0.4858
dipole: 5.6408
quadrupole: -95.0024 -124.5740 -114.9271
quadrupole: 9.8877 -3.8482 -3.9928
quadrupole: 16.4988 -13.0728 -3.4259 9.8877 -3.8482 -3.9928
hfenergy: -933.9140977 hartree
pointgroup: C01 [X(C15H13N1O4)]
dipole: -2.1563928 -0.4854045 -0.1988197 debye
polarizability: 292.4896804|0.7515388|183.65747|0.3080234|9.5728029|94.1089197 unknown
InChI: InChI=1S/C15H13NO4/c17-13-11-3-1-2-4-12(11)14(18)16(13)10-7-5-9(6-8-10)15(19)20/h5-8,19H,1-4H2
charge 0 multiplicity 1
33 atoms
O  -1.043523 -2.350557 0.26628
O  -1.051977 2.349028 -0.271224
O  5.743126 -1.12581 -0.465596
O  5.855667 1.017758 0.418744
N  -0.594369 0.000091 -0.001758
C  -2.853956 -0.682309 0.074376
C  -2.856398 0.674789 -0.076098
C  -4.082796 -1.537319 0.18447
C  -4.088209 1.525627 -0.18494
C  -5.323215 -0.640753 0.449246
C  -5.325838 0.624901 -0.448475
C  -1.436683 -1.167125 0.128685
C  -1.440882 1.164518 -0.132002
C  0.838779 0.002692 -0.001502
C  1.548227 1.139577 0.473555
C  1.552197 -1.131349 -0.475615
C  2.952791 1.136446 0.467243
C  2.957877 -1.126924 -0.468486
C  3.670962 0.005814 -0.000119
C  5.153997 0.054607 0.021225
H  -4.213289 -2.116157 -0.753079
H  -3.952779 -2.293079 0.982261
H  -4.219648 2.103949 0.752789
H  -3.961514 2.281933 -0.982746
H  -6.246353 -1.224649 0.280961
H  -5.326066 -0.330185 1.512726
H  -6.250764 1.205671 -0.279211
H  -5.328759 0.314355 -1.511967
H  1.003538 2.016608 0.826554
H  1.009716 -2.009604 -0.829099
H  3.514978 2.003433 0.828649
H  3.514127 -1.995749 -0.830195
H  6.732035 -1.026029 -0.423849
