program: Gaussian 09
title: 000005830
version: EM64L-G09RevD.01
frameworkgroup: C1[X(C6H14N2S2)]
method: RPBEPBE
basis: SDD
operation: Freq
keyword: #p
keyword: freq=noraman
keyword: PBEPBE/SDD
title: #p freq=noraman PBEPBE/SDD
converged: YES YES NO NO
title: Mulliken charges:
elementType: S S N N C C C C C C H H H H H H H H H H H H H H
charge: 0.060038 -0.066580 -0.001751 0.004644 -0.562689 -0.589416 -0.589371 -0.431855 -0.616572 -0.616796 0.300076 0.261072 0.226186 0.226286 0.222630 0.218226 0.256193 0.220080 0.233435 0.230823 0.273146 0.226189 0.257089 0.258916
chargesum: 0.00000
title: Mulliken charges with hydrogens summed into heavy atoms:
elementType: S S N N C C C C C C
charge: 0.060038 -0.066580 -0.001751 0.004644 -0.001541 0.085686 0.105128 -0.431855 0.120833 0.125398
polarizability: 1.66941103e+02 -3.98937765e+00 1.21434540e+02 6.12299385e+00 -9.69677854e-01 8.00950358e+01
1716.lowfreq: -0.0028 -0.0017 0.0014 7.1554 8.9606 18.5824 30.9225 53.5898 55.4612
frequency: 30.5446 53.2325 55.3472 86.3529 101.8947 116.7973 142.0420 186.1757 187.1899 206.1258 248.4820 254.9679 314.4126 365.1188 398.7657 406.5368 427.4833 454.6203 499.4215 536.5870 538.8229 819.5908 853.5507 905.4357 943.3129 1048.5052 1048.8573 1083.0746 1085.5902 1091.6188 1123.9092 1133.8473 1136.9521 1141.1457 1210.2883 1240.1591 1324.2860 1357.6031 1367.9669 1418.8342 1424.1265 1427.3156 1450.4628 1454.2271 1459.0147 1461.1149 1468.7260 1474.3305 1477.5501 1485.5188 1495.0873 1500.0577 2923.8647 2935.1354 2970.5196 2982.0010 3007.4923 3037.6498 3042.2203 3054.8491 3065.7094 3090.3837 3104.9839 3106.5055 3110.1180 3132.1432
redmass: 3.2262 2.1403 1.8288 2.7313 1.6919 1.5302 2.7909 1.9103 1.2913 1.3581 3.0796 2.9848 7.5716 4.2918 2.9238 3.7175 4.8771 1.8573 4.7458 4.6431 9.3418 4.0880 5.1261 1.6380 4.3448 1.5316 1.5667 1.2280 1.2986 1.6949 1.8303 1.3695 1.3913 1.4421 1.2134 3.5602 1.9318 2.7675 2.4372 1.1375 1.1411 1.1149 1.1506 1.0503 1.0580 1.1537 1.0623 1.0662 1.0513 1.0615 1.2934 1.1582 1.0475 1.0471 1.0343 1.0350 1.0631 1.0834 1.0857 1.1021 1.1005 1.1014 1.1005 1.1010 1.0987 1.1092
irintensity: 3.2311 0.4641 1.5011 0.6555 0.4975 3.7710 17.7128 2.1629 2.5782 9.3382 5.7693 4.1021 1.6093 3.5096 7.5921 91.3036 40.7395 0.2717 147.7021 0.9656 6.7279 21.3113 16.9274 53.0542 124.6329 13.5029 14.9270 0.5441 6.3263 136.0720 121.6392 0.8977 2.5043 13.2965 33.5250 37.1117 8.9024 85.7307 86.5989 26.3988 9.5075 12.0934 23.0588 12.9432 24.8028 21.5120 37.1471 10.8129 15.2916 18.2520 135.9408 37.4717 57.4263 66.3333 67.2588 52.7139 36.4511 46.3510 50.0282 32.5274 19.3749 23.0178 30.4167 14.0517 2.6441 5.7555
temp: 298.150 k
press: 1.00000 atm
elementType: 16 16 7 7 6 6 6 6 6 6 1 1 1 1 1 1 1 1 1 1 1 1 1 1
symmnumber: 1
zpe: 520893.3 jmol-1
zpe.correction: 0.198398 hartree
zpe.thermalcorrener: 0.212415 hartree
zpe.thermalcorrenthalpy: 0.213359 hartree
zpe.thermalcorrgfe: 0.156331 hartree
zpe.sumelectzpe: -1141.822500 hartree
zpe.sumelectthermal: -1141.808483 hartree
zpe.sumelectthermalent: -1141.807539 hartree
zpe.sumelectthermalfe: -1141.864567 hartree
dipole: 0.0390 -3.0213 1.7531
dipole: 3.4933
quadrupole: -59.6411 -80.8842 -76.8743
quadrupole: -3.3268 1.5739 0.9441
quadrupole: 12.8255 -8.4177 -4.4078 -3.3268 1.5739 0.9441
hfenergy: -1142.020898 hartree
pointgroup: C01 [X(C6H14N2S2)]
dipole: 0.1795496 0.9766376 0.9501641 debye
dipolederiv: -1.3177027 -0.1151156 0.0536138 -0.0417882 -0.5094014 0.0591282 0.4053825 -0.0575773 -0.2063613 -0.5072229 -0.0631692 0.0419507 -0.1411893 -0.8609597 -0.2123793 0.0461286 -0.2052895 -0.355547 -1.3202148 0.2352235 0.0481795 0.4679501 -0.4950606 -0.0141178 -0.2601278 0.077944 -0.493081 -1.0623347 0.2648736 0.4015294 0.0685065 -0.602926 -0.1884222 0.4726284 -0.3213301 -0.4736283 1.6879892 -0.5144241 0.0123212 -1.0950465 0.2301516 -0.0058614 -0.0813324 -0.0759796 0.3147434 0.5144268 0.0415841 -0.0025773 0.203223 0.2378455 0.1215445 -0.0404392 0.1339512 0.216894 0.0997673 -0.0679577 -0.0949009 -0.2581257 0.2558375 -0.0938807 -0.0370922 -0.1237508 0.3018874 1.3324094 -0.024523 -0.5375068 0.462163 1.0746325 0.4138806 -0.5345487 0.4870199 0.2572236 0.3651165 0.0161818 -0.0328789 0.2971038 0.0087792 -0.2001858 0.0605652 -0.0897287 0.1943077 0.0786795 -0.0002503 0.0402142 -0.1542846 0.3520606 0.068684 -0.0062084 0.0363301 0.2279991 0.0996623 0.0327143 -0.0791559 0.1347543 0.0280837 -0.0875278 0.0433542 -0.0315024 0.080642 -0.0342561 -0.0068698 0.0856275 0.0498523 0.0053135 0.1149905 0.1001243 0.0523553 -0.0129942 0.0975385 -0.0251307 0.0055478 -0.0889861 -0.0060854 0.0845812 0.0844104 0.1143104 -0.0683345 -0.1331981 0.0516915 -0.0695421 0.1399746 0.0351723 0.0312827 -0.1181206 0.008392 0.0763125 0.0030897 0.0768314 0.0944759 -0.1201978 -0.0233263 -0.1082741 -0.0345016 -0.1303323 -0.076502 -0.148188 0.1457717 -0.0743448 0.0815294 0.055946 0.0491898 -0.053948 0.0705508 0.0534318 0.096951 -0.1463147 -0.0193397 -0.0838468 0.0267837 -0.0170291 -0.0223356 -0.0611286 0.0467515 0.0899768 0.0001662 0.1150256 0.0793472 -0.0164386 -0.1017654 0.018411 0.0356424 -0.1305089 -0.160578 0.063623 -0.0165871 0.098453 0.0485743 0.0881455 -0.0769818 0.0698437 0.0485785 -0.0194876 -0.0093677 0.0370211 -0.036703 0.1210344 0.0060909 0.11297 0.0286075 -0.1636043 0.220637 0.0523055 -0.0110916 -0.0956542 -0.0100882 -0.0141174 -0.0795822 -0.0725779 0.1233272 -0.1068055 0.0773553 0.1455666 -0.0270475 0.0875778 0.0034455 0.1226818 -0.0498477 0.0308058 0.1287387 -0.0223153 -0.0109243 0.0442067 -0.0726507 0.0225836 -0.0203801 0.1076426 -0.0361971 -0.0049943 -0.0628837 -0.1322239 0.0158056 0.0291442 -0.0199862 -0.1010578 -0.0035447 0.0438539 unknown
polarizability: 163.2827163|-4.0312149|118.9058685|-16.972506|11.9687712|86.2820941 unknown
InChI: InChI=1S/C6H14N2S2/c1-7(2)5-10-6(9)8(3)4/h5H2,1-4H3
charge 0 multiplicity 1
24 atoms
S  0.312507 1.354694 -0.709547
S  -1.065195 -1.442774 -1.125911
N  2.801881 -0.214457 -0.821337
N  -2.141912 0.701902 0.196517
C  1.742168 0.196973 -1.644137
C  3.780125 0.804758 -0.404385
C  2.504701 -1.238576 0.198044
C  -1.08051 0.162149 -0.495734
C  -3.391629 -0.054152 0.421615
C  -2.129787 2.090236 0.710702
H  1.104681 -0.63123 -1.997478
H  2.053924 0.891043 -2.437563
H  4.040561 1.447944 -1.262666
H  4.701025 0.310416 -0.047806
H  3.389716 1.452088 0.413106
H  3.441921 -1.731214 0.512198
H  1.818178 -1.990645 -0.222525
H  2.014116 -0.796731 1.093673
H  -4.241787 0.464463 -0.060551
H  -3.590795 -0.142315 1.506081
H  -3.283401 -1.058708 -0.013686
H  -3.021503 2.237243 1.340824
H  -2.146989 2.825134 -0.115694
H  -1.225597 2.27616 1.316459
