program: Gaussian 09
title: 000038595
version: EM64L-G09RevD.01
frameworkgroup: C1[X(C23H29NO6)]
method: RPBEPBE
basis: SDD
operation: Freq
keyword: #p
keyword: freq=noraman
keyword: PBEPBE/SDD
title: #p freq=noraman PBEPBE/SDD
converged: YES YES NO NO
title: Mulliken charges:
elementType: O O O O O O N C C C C C C C C C C C C C C C C C C C C C C C H H H H H H H H H H H H H H H H H H H H H H H H H H H H H
charge: -0.301575 -0.474074 -0.209545 -0.292021 -0.261814 -0.438144 -0.087309 -0.269285 0.417230 -0.453127 0.006257 -0.078290 -0.564003 0.258098 0.041663 0.032696 0.519405 -0.380261 -0.272818 -0.375421 -0.176230 -0.369559 -0.427250 -0.539318 -0.394177 -0.345832 0.276245 -0.519580 -0.614580 -0.622214 0.239763 0.192893 0.269711 0.232796 0.205394 0.274535 0.234742 0.248156 0.334118 0.218625 0.192001 0.265095 0.255221 0.232397 0.271314 0.220139 0.223557 0.215041 0.246760 0.229520 0.221027 0.256182 0.222830 0.187755 0.229076 0.185147 0.233691 0.226598 0.350749
chargesum: 0.00000
title: Mulliken charges with hydrogens summed into heavy atoms:
elementType: O O O O O O N C C C C C C C C C C C C C C C C C C C C C C C
charge: -0.301575 -0.139956 -0.209545 -0.292021 -0.261814 -0.087395 -0.087309 -0.029522 0.417230 0.009477 0.006257 -0.078290 -0.125812 0.258098 0.041663 0.032696 0.519405 -0.105726 0.210080 0.035204 0.088866 -0.114338 -0.194852 0.175693 -0.179136 -0.099072 0.276245 0.187149 0.025080 0.023221
polarizability: 3.22622492e+02 -7.32716879e+00 3.13532934e+02 -3.67479995e+01 1.19936431e+01 2.20223809e+02
1716.lowfreq: -12.7422 -2.7797 -0.0011 0.0003 0.0005 4.1008 4.8860 13.3551 16.6217
frequency: -9.9241 13.1872 16.4363 27.7723 31.6655 34.7707 48.3369 63.3186 64.4838 78.2696 82.2717 84.6118 88.8256 120.9532 140.0743 154.2291 156.8473 165.3328 174.1385 178.4337 190.6298 213.3114 225.0045 231.5916 236.8202 247.1403 261.6211 276.9302 289.5479 300.1500 318.8217 320.7413 328.3571 341.7293 347.7910 353.8998 362.2710 400.9099 402.7742 412.2549 413.8484 440.3064 469.2007 474.8760 499.2012 520.5816 524.2785 550.8619 572.3007 577.6624 589.4839 636.2320 690.8816 709.8277 717.6892 747.3977 758.7293 760.8851 783.8515 797.5830 810.6932 813.2510 820.7826 823.8583 832.7699 844.9950 855.8264 872.2564 880.4597 907.1012 927.7689 936.5459 941.7249 960.0264 976.4315 1003.1562 1005.1302 1007.3682 1032.5064 1034.2278 1040.0411 1047.6699 1063.0543 1069.4345 1087.7100 1093.2042 1105.2470 1105.9503 1109.6279 1120.5693 1128.3917 1137.9793 1143.9169 1153.3191 1154.9715 1164.3483 1166.3323 1180.2682 1191.5506 1216.2279 1219.5593 1244.0502 1244.1472 1268.9378 1269.5038 1282.0673 1287.7037 1291.8545 1315.9763 1320.5777 1336.4199 1338.5108 1345.1486 1355.1962 1380.1066 1391.2869 1396.5914 1415.2803 1419.2426 1423.6351 1426.3277 1428.1045 1443.3313 1451.3298 1457.8481 1458.5223 1461.5837 1462.3093 1469.7939 1473.8522 1478.3032 1479.7481 1481.6671 1485.2050 1486.6823 1489.2333 1503.4124 1519.7089 1589.3215 1599.2902 1610.5074 1626.7849 2845.2862 2854.4073 2874.7072 2963.0518 2964.4828 2976.3392 2984.4709 2989.0787 2999.2381 3019.6845 3025.0345 3037.7004 3038.3232 3064.7254 3073.2414 3079.4358 3080.1626 3084.0440 3090.5063 3106.1631 3115.1018 3123.3485 3126.1524 3133.5237 3168.2849 3232.2486 3267.3868 3528.6976 3582.5616
redmass: 3.7706 5.2305 5.7015 3.8455 2.9467 4.4390 4.1355 4.4915 3.7770 3.3910 2.7257 3.1717 3.3070 2.7489 4.2612 3.3593 1.4678 3.9673 1.5349 1.7671 2.9016 2.6620 4.3831 3.0361 1.0954 1.4666 4.5317 4.2597 3.2763 3.4216 2.3063 2.3285 3.2157 4.6343 1.1460 3.1201 5.0596 3.5419 3.9067 2.9437 2.7325 3.7421 4.3625 5.0121 4.1035 5.3472 5.9821 2.9342 4.6696 5.4203 5.6047 6.7628 6.9287 6.2584 3.7115 4.7317 1.6202 2.5053 1.8604 1.7497 1.4863 4.7681 2.3428 2.5285 2.1318 5.3802 4.0215 1.3732 4.9012 8.3225 5.8418 3.9597 1.6526 1.3564 3.8680 2.7019 2.8459 5.6271 3.3232 2.1876 1.6429 2.5480 1.5906 2.2641 1.8703 1.6993 1.6768 1.7508 1.4833 1.2414 2.0001 1.4294 1.3835 1.3626 1.4027 1.2694 1.3917 1.1212 1.9672 2.2056 1.7448 2.8713 1.7494 1.3673 2.1926 1.2955 1.3127 2.4735 1.8850 1.3736 1.2998 1.5743 4.6317 1.3411 4.4216 5.9764 1.6376 1.9306 1.4126 1.2568 2.7464 1.2334 1.1541 1.5788 1.0588 1.0634 1.0578 1.4113 1.0721 1.0784 1.0541 1.1033 1.0583 1.0561 1.0557 1.0810 2.7269 5.6619 9.4626 6.4095 10.7604 6.3985 1.0571 1.0600 1.0670 1.0334 1.0666 1.0315 1.0597 1.0830 1.0565 1.0725 1.0722 1.1000 1.0901 1.1044 1.1078 1.1017 1.1022 1.1013 1.0929 1.0878 1.1031 1.0898 1.1036 1.0962 1.0951 1.0916 1.1082 1.0655 1.0660
irintensity: 0.2378 0.0897 0.0961 0.5175 0.2935 0.2889 1.8363 0.4668 1.2246 6.3821 1.4841 3.4672 4.2140 0.6624 0.6714 5.1833 0.2337 1.6698 3.9256 4.3668 1.7256 5.9907 1.7827 6.7007 7.4360 2.8337 2.2223 4.3675 18.0154 12.0883 37.1657 52.2482 36.6255 10.1867 139.6257 11.4740 6.9403 17.7616 2.3854 0.9372 0.3691 9.1420 20.1166 8.4644 12.8048 3.8359 2.9154 19.1301 9.7504 0.7745 3.3690 0.0276 12.0163 5.1031 0.4733 34.6920 24.6288 34.0871 31.1529 6.8728 20.4066 12.8477 3.2116 18.5027 27.3229 19.4507 23.6854 8.9170 12.1391 17.4351 93.8587 15.1507 14.8171 0.6838 28.9052 32.2944 16.6005 216.1308 12.0466 25.5869 33.2505 77.6479 9.9747 33.7663 7.6445 8.8627 59.7459 24.6754 5.1131 3.9379 37.2443 5.3193 226.6150 0.6310 0.9687 10.4432 8.9790 4.8114 108.0236 25.5972 30.6625 24.9232 3.4363 3.7673 10.0516 18.0367 2.7906 19.4809 105.0660 21.6023 9.0613 5.8074 52.7954 4.6830 8.2435 9.1185 3.3855 23.9311 18.4525 9.8994 16.0720 16.7988 2.8844 77.5842 2.9802 10.3271 7.3844 52.6317 6.4434 9.4442 18.4591 9.3111 8.8266 11.1297 10.9287 18.9304 118.9609 7.2566 6.4170 7.4423 20.7716 24.6076 66.8781 145.9643 153.4035 67.1894 43.0162 72.8678 31.2430 20.7839 24.3997 40.8746 51.3579 17.5554 10.1049 17.9579 11.1459 39.4129 25.1605 46.0926 12.1133 19.8308 24.1824 18.1339 21.5038 7.3220 9.2402 2.0447 0.3274 6.4519 37.1259
temp: 298.150 k
press: 1.00000 atm
elementType: 8 8 8 8 8 8 7 6 6 6 6 6 6 6 6 6 6 6 6 6 6 6 6 6 6 6 6 6 6 6 1 1 1 1 1 1 1 1 1 1 1 1 1 1 1 1 1 1 1 1 1 1 1 1 1 1 1 1 1
symmnumber: 1
zpe: 1253953.7 jmol-1
zpe.correction: 0.477606 hartree
zpe.thermalcorrener: 0.508448 hartree
zpe.thermalcorrenthalpy: 0.509392 hartree
zpe.thermalcorrgfe: 0.412888 hartree
zpe.sumelectzpe: -1397.578755 hartree
zpe.sumelectthermal: -1397.547913 hartree
zpe.sumelectthermalent: -1397.546969 hartree
zpe.sumelectthermalfe: -1397.643473 hartree
dipole: -0.2808 -1.1807 1.6607
dipole: 2.0569
quadrupole: -182.8442 -162.4869 -168.3476
quadrupole: -23.4105 -15.7410 3.7046
quadrupole: -11.6180 8.7394 2.8786 -23.4105 -15.7410 3.7046
hfenergy: -1398.0563611 hartree
pointgroup: C01 [X(C23H29N1O6)]
dipole: 0.1109598 -0.3748594 -0.7085385 debye
polarizability: 317.6369579|11.8756437|316.9043327|-39.5812913|-4.0935382|221.8379444 unknown
InChI: InChI=1S/C23H29NO6/c1-24(2)12-14-30-22-19(18(26)10-7-15-5-8-16(25)9-6-15)20(27-3)17-11-13-29-21(17)23(22)28-4/h5-6,8-9,11,13,18,25-26H,7,10,12,14H2,1-4H3
charge 0 multiplicity 1
59 atoms
O  -2.310962 -0.911774 0.997914
O  -0.69554 -1.187762 -2.159019
O  -2.165339 4.014322 1.237708
O  0.876614 1.803257 -1.647367
O  -3.445764 1.482191 2.068005
O  7.863325 -0.891055 0.135413
N  -4.607832 -3.430295 -0.572837
C  -0.109829 -0.93672 -0.798223
C  -0.67418 0.389688 -0.308881
C  1.429938 -1.043568 -0.849179
C  -1.764644 0.343536 0.627086
C  -0.1829 1.656682 -0.717634
C  2.101453 -0.806488 0.530757
C  -0.734263 2.834316 -0.153394
C  -2.335344 1.505771 1.213557
C  -1.77986 2.732064 0.803177
C  3.62056 -0.817546 0.438823
C  -0.462743 4.253609 -0.31266
C  -3.372087 -1.378704 0.048074
C  -3.720311 -2.819613 0.442909
C  -1.330678 4.917753 0.526616
C  4.303305 0.252611 -0.195268
C  4.393705 -1.888571 0.95604
C  0.434884 1.76717 -3.065478
C  5.709619 0.257571 -0.310708
C  5.800554 -1.902605 0.847776
C  6.457204 -0.825784 0.212378
C  -3.25179 0.769787 3.353475
C  -5.501629 -4.468082 -0.02373
C  -3.882695 -3.899931 -1.770989
H  -0.492667 -1.720436 -0.11422
H  1.698048 -2.061696 -1.20433
H  1.828419 -0.31784 -1.575567
H  1.756365 0.170976 0.918879
H  1.75548 -1.575991 1.248301
H  0.290263 4.701204 -0.956664
H  -4.252562 -0.716866 0.137871
H  -2.968233 -1.320826 -0.979523
H  -0.278769 -2.016451 -2.513582
H  -4.244711 -2.809588 1.415508
H  -2.772183 -3.395543 0.589489
H  -1.501836 5.966689 0.752488
H  3.724132 1.093053 -0.598147
H  3.888932 -2.724978 1.455061
H  -0.06467 0.805091 -3.279571
H  -0.252259 2.610427 -3.271685
H  1.353491 1.876769 -3.662909
H  6.219751 1.098776 -0.799282
H  6.398678 -2.726484 1.248469
H  -4.227216 0.824589 3.859953
H  -2.483444 1.286264 3.959468
H  -2.961487 -0.279681 3.175233
H  -6.205282 -4.800783 -0.808279
H  -4.959454 -5.372399 0.35435
H  -6.094631 -4.049872 0.808527
H  -3.211499 -4.771936 -1.558226
H  -3.26438 -3.087448 -2.190353
H  -4.607718 -4.207046 -2.545846
H  8.224573 -0.090204 -0.319251
