program: Gaussian 09
title: 000038646
version: EM64L-G09RevD.01
frameworkgroup: C1[X(C29H12Cl8N6O2)]
method: RPBEPBE
basis: SDD
operation: Freq
keyword: #p
keyword: freq=noraman
keyword: PBEPBE/SDD
title: #p freq=noraman PBEPBE/SDD
converged: YES YES NO NO
title: Mulliken charges:
elementType: Cl Cl Cl Cl Cl Cl Cl Cl O O N N N N N N C C C C C C C C C C C C C C C C C C C C C C C C C C C C C H H H H H H H H H H H H
charge: 0.003085 0.083689 0.004035 0.084197 0.071150 0.075438 0.072034 0.076185 -0.148879 -0.148609 -0.413627 -0.405110 -0.113727 -0.117533 -0.077268 -0.112317 0.378542 0.129423 0.357767 0.379336 0.357435 0.131251 0.490047 -0.306505 -0.050642 -0.409498 0.444692 -0.306344 -0.668669 -0.050116 -0.408508 0.465568 -0.314703 -0.049885 -0.137563 -0.125188 -0.137796 -0.293194 -0.125093 -0.293619 -0.442450 -0.799456 0.162180 -0.297736 -0.327309 0.321803 0.318926 0.235442 0.340545 0.279814 0.340435 0.232958 0.247631 0.215454 0.247519 0.276118 0.258647
chargesum: 0.00000
title: Mulliken charges with hydrogens summed into heavy atoms:
elementType: Cl Cl Cl Cl Cl Cl Cl Cl O O N N N N N N C C C C C C C C C C C C C C C C C C C C C C C C C C C C C
charge: 0.003085 0.083689 0.004035 0.084197 0.071150 0.075438 0.072034 0.076185 -0.148879 -0.148609 -0.091824 -0.086184 -0.113727 -0.117533 -0.077268 -0.112317 0.378542 0.129423 0.357767 0.379336 0.357435 0.131251 0.490047 -0.306505 -0.050642 -0.409498 0.444692 -0.306344 -0.433227 -0.050116 -0.408508 0.465568 0.025842 -0.049885 -0.137563 -0.125188 -0.137796 -0.013381 -0.125093 0.046816 -0.209492 -0.088852 0.162180 -0.021617 -0.068662
chargesum: 0.00011
polarizability: 1.66353996e+03 6.16636192e+01 5.34661421e+02 2.54897937e-02 6.34307168e-02 1.57776123e+02
1716.lowfreq: -3.1688 -1.4662 -0.8265 -0.0027 0.0014 3.5280 5.8352 7.9823 12.7913
frequency: 5.8349 7.9768 12.7857 17.1145 28.6828 34.6033 39.7252 49.1250 56.5708 63.2855 64.4540 65.7945 70.8407 73.3917 78.9579 87.9537 100.0175 106.8598 140.8850 149.1927 158.9660 168.1076 178.8519 179.4577 181.6386 192.5118 202.1620 205.7245 206.2464 213.3054 215.8226 218.5450 221.1425 231.5077 235.3341 251.4460 265.4864 281.2398 300.2091 302.1757 308.2765 310.9687 325.1810 332.6636 336.5529 340.7294 345.1325 346.3268 371.3159 404.1537 415.9824 421.4388 436.3058 458.5401 471.3190 491.3016 517.8539 521.2573 546.2566 551.9384 562.4791 567.5480 588.5628 590.9250 592.3449 602.4031 615.0654 619.0651 647.6863 658.3955 684.3771 685.0448 688.7610 693.9961 696.4250 697.1894 717.4437 718.5677 723.1748 731.3132 735.4681 744.2470 745.8819 762.1393 775.2040 775.7138 781.6119 798.2399 835.0824 839.1127 857.0425 858.1983 875.2798 886.6370 889.2286 892.1328 893.7550 896.9460 937.6903 967.8415 997.1751 1003.0979 1023.1358 1025.4902 1046.4989 1062.1370 1069.1571 1074.5428 1075.9328 1104.7028 1120.3725 1153.1951 1159.8796 1164.0416 1183.3857 1193.3567 1220.1541 1225.4444 1239.1488 1251.2268 1265.8849 1303.6111 1305.4516 1316.9122 1319.5204 1328.7853 1335.1806 1336.5752 1371.7832 1378.3172 1387.1667 1390.5122 1401.7607 1423.7147 1438.0712 1456.6034 1471.7995 1483.2090 1487.5534 1521.4465 1524.6367 1540.1621 1547.1457 1560.0692 1560.6263 1564.8555 1565.3864 1592.4721 1596.8393 1612.6242 1615.8255 1653.0360 1653.2127 2994.4386 3080.6630 3094.1323 3112.9713 3122.6060 3162.3548 3163.3178 3169.2979 3177.7058 3179.7710 3449.6440 3450.3712
redmass: 11.6081 18.0215 12.9920 12.0540 7.1397 7.4633 13.2782 5.0489 11.2782 16.2412 19.0420 9.8620 9.3144 16.0166 20.7928 7.1183 1.3164 4.2039 11.3325 9.8488 9.6983 11.9186 8.7510 10.9314 11.5199 4.5096 20.4977 27.0317 19.5696 10.8453 23.1028 16.8664 15.3354 6.3978 7.4840 4.8897 7.9093 6.8931 11.7284 12.0652 18.1965 18.6269 16.9497 10.1583 15.3311 10.8211 23.1492 17.3769 6.2173 4.0384 5.1781 3.4575 13.6613 3.1788 7.6925 6.9269 7.9739 10.2777 2.8650 8.1226 6.1480 12.1331 10.9309 9.9402 11.5795 3.0823 9.2278 7.9420 8.9992 8.4865 5.2344 6.1945 11.5743 11.1334 13.3317 13.4517 7.9487 2.3017 4.2278 3.2135 1.7528 2.8844 9.1767 3.2544 10.5939 10.9544 6.9788 6.3414 1.3720 6.1560 12.2989 11.1587 1.4014 1.4684 9.0144 1.5423 10.7599 7.5218 3.6362 1.3774 2.7342 1.6659 1.3188 1.3083 1.5723 8.9610 6.7911 10.6928 10.4037 2.8175 1.3335 1.5993 2.9610 6.7788 2.4546 1.7949 5.2486 5.2429 2.9418 1.9926 2.6945 1.9236 2.1216 8.9662 4.8251 6.4890 10.6658 9.9582 6.3355 8.6104 9.2031 8.1041 1.2922 2.4984 4.2429 1.0462 2.1184 1.6875 2.4207 2.6084 2.7336 6.7913 7.5953 10.7374 10.1418 11.3579 11.4669 3.0056 2.7271 5.0618 5.0817 12.5542 12.5514 1.0364 1.0968 1.1007 1.0914 1.0902 1.0897 1.0892 1.0949 1.0969 1.0974 1.0770 1.0770
irintensity: 0.3684 1.3729 0.3044 0.0004 0.2155 0.0952 0.0005 0.2509 0.0275 1.6056 0.0011 0.1894 0.6260 1.0712 0.0001 3.7874 1.8416 0.5203 0.4344 0.0894 16.8954 0.1849 0.0611 1.5938 4.7546 1.7202 0.1323 0.8716 0.0379 0.8356 0.0918 0.1108 0.2612 0.0643 0.4050 3.0402 0.6622 4.9427 0.1023 8.5088 0.7725 4.0187 3.2713 0.0515 0.0296 0.2597 0.8418 0.7973 0.0001 3.4287 7.4978 2.1129 19.8197 0.5076 17.9749 33.0257 2.0486 0.2723 22.0341 23.9687 12.2601 0.0158 11.6256 8.1835 0.5737 16.3252 1.3923 6.4821 31.8623 0.0009 0.8724 0.4948 170.6400 40.7973 10.5779 22.7683 51.2204 7.8736 3.2710 24.8126 52.9708 4.4357 61.8224 3.0397 2.6031 1.9183 1.8956 40.9840 40.1630 1.2976 17.5028 14.7377 2.6843 1.8896 80.3264 126.7413 60.3179 29.8646 33.0038 0.2186 12.9303 29.3741 1.1161 1.5555 10.0849 263.7050 302.8291 643.5374 0.3554 1.4165 46.6728 72.2319 140.0852 200.0907 174.0816 52.1046 106.7158 10.4893 153.2803 4.5134 7.8392 6.1015 19.1432 51.4545 51.4851 7.8005 473.8547 4.4340 96.2990 0.6597 34.3964 1.9987 22.7631 28.0821 25.5911 13.4495 11.6768 2.1293 46.3587 678.4048 155.6994 1920.4111 16.3033 56.6934 3.4545 31.7114 9.1137 276.8250 320.7208 12.1089 60.0688 129.7110 74.7762 18.8887 10.1658 22.6353 29.1990 23.1206 11.2427 6.3158 4.1660 4.8119 6.9270 132.9613 102.7658
temp: 298.150 k
press: 1.00000 atm
elementType: 17 17 17 17 17 17 17 17 8 8 7 7 7 7 7 7 6 6 6 6 6 6 6 6 6 6 6 6 6 6 6 6 6 6 6 6 6 6 6 6 6 6 6 6 6 1 1 1 1 1 1 1 1 1 1 1 1
symmnumber: 1
zpe: 912785.1 jmol-1
zpe.correction: 0.347661 hartree
zpe.thermalcorrener: 0.388260 hartree
zpe.thermalcorrenthalpy: 0.389204 hartree
zpe.thermalcorrgfe: 0.266544 hartree
zpe.sumelectzpe: -5268.600744 hartree
zpe.sumelectthermal: -5268.560146 hartree
zpe.sumelectthermalent: -5268.559201 hartree
zpe.sumelectthermalfe: -5268.681861 hartree
dipole: -0.2281 -0.4853 0.0081
dipole: 0.5363
quadrupole: -324.9675 -328.2340 -313.2221
quadrupole: -77.8108 -0.0048 0.0389
quadrupole: -2.8263 -6.0928 8.9191 -77.8108 -0.0048 0.0389
hfenergy: -5268.9484054 hartree
pointgroup: C01 [X(C29H12Cl8N6O2)]
dipole: 0.0932563 0.1892478 -0.0014097 debye
polarizability: 1665.4292456|40.8215265|532.5385807|0.349764|-9.3308403|158.0096726 unknown
InChI: InChI=1S/C29H12Cl8N6O2/c1-9-8-12(39-27-15-17(29(45)41-27)21(33)25(37)23(35)19(15)31)6-7-13(9)43-42-11-4-2-10(3-5-11)38-26-14-16(28(44)40-26)20(32)24(36)22(34)18(14)30/h2-8,38-39H,1H3
charge 0 multiplicity 1
57 atoms
Cl -8.293333 2.912943 -0.200824
Cl -11.224923 -2.845584 -0.064406
Cl 8.314936 -3.100852 -0.035294
Cl 11.352789 2.601949 -0.17695
Cl -11.493307 2.721143 -0.197659
Cl -12.965195 -0.127449 -0.129401
Cl 11.518353 -2.968503 -0.038265
Cl 13.042432 -0.1474 -0.108572
O  -8.078174 -3.465801 -0.046431
O  8.217742 3.280397 -0.197138
N  -5.922617 0.735391 -0.146209
N  5.985202 -0.880065 -0.091814
N  -6.646149 -1.557446 -0.090903
N  6.751168 1.398513 -0.150354
N  -0.261255 0.565075 -0.13505
N  0.32351 -0.611302 -0.102885
C  -8.353238 0.098747 -0.132632
C  -6.883197 -0.235681 -0.12334
C  -9.010663 -1.159159 -0.102711
C  8.427424 -0.288622 -0.106018
C  9.107857 0.956938 -0.137241
C  6.963995 0.072696 -0.116067
C  -4.510083 0.599839 -0.141061
C  -9.104152 1.279915 -0.161753
C  -7.912258 -2.226719 -0.075985
C  -10.405415 -1.249271 -0.101597
C  -2.348505 1.794094 -0.169011
C  9.156205 -1.483499 -0.075742
C  -3.755774 1.805384 -0.171191
C  8.029551 2.044575 -0.165858
C  10.504059 1.021195 -0.138219
C  4.575371 -0.718444 -0.097044
C  -3.847982 -0.660398 -0.107743
C  -1.685146 0.521605 -0.13552
C  -10.522137 1.210977 -0.160794
C  -11.171632 -0.049433 -0.130768
C  10.575293 -1.440815 -0.07659
C  -2.448603 -0.682049 -0.105521
C  11.247957 -0.192607 -0.107671
C  3.9370 0.556573 -0.131956
C  3.795389 -1.9090 -0.065299
C  -1.564373 3.090253 -0.200982
C  1.748224 -0.563233 -0.103014
C  2.53725 0.624166 -0.134579
C  2.39596 -1.82918 -0.068417
H  -6.273658 1.700354 -0.17046
H  6.318054 -1.85152 -0.066719
H  -4.278121 2.770728 -0.197038
H  -4.443565 -1.575349 -0.084744
H  -1.907792 -1.63251 -0.080325
H  4.557414 1.455515 -0.156105
H  4.287554 -2.889136 -0.038164
H  -0.900943 3.131384 -1.082372
H  -2.240387 3.961908 -0.228554
H  -0.910388 3.180457 0.683907
H  2.026764 1.591127 -0.160999
H  1.774712 -2.729615 -0.044449
