program: Gaussian 09
title: 000005802
version: EM64L-G09RevD.01
frameworkgroup: C1[X(C4H3BrN2O2)]
method: RPBEPBE
basis: SDD
operation: Freq
keyword: #p
keyword: freq=noraman
keyword: PBEPBE/SDD
title: #p freq=noraman PBEPBE/SDD
converged: NO NO NO NO
title: Mulliken charges:
elementType: Br O O N N C C C C H H H
charge: 0.087266 -0.213152 -0.236664 -0.399417 -0.356704 0.264028 0.180819 -0.244100 -0.086080 0.371604 0.357620 0.274781
chargesum: 0.00000
title: Mulliken charges with hydrogens summed into heavy atoms:
elementType: Br O O N N C C C C
charge: 0.087266 -0.213152 -0.236664 -0.027814 0.000917 0.264028 0.180819 -0.244100 0.188700
polarizability: 1.22624908e+02 -1.02475730e+01 7.72783851e+01 4.58477770e-03 -1.75559675e-03 2.91024941e+01
1716.lowfreq: -2.9232 -2.0162 0.0006 0.0006 0.0008 13.4246 88.3052 162.9203 177.3406
frequency: 88.3027 162.9157 177.3405 269.3422 277.4542 368.9331 397.0670 510.8247 565.3856 597.1448 627.3891 690.8556 724.6633 744.1041 779.3265 891.5415 939.8222 1016.2842 1145.1690 1170.4098 1312.5732 1354.7906 1371.6637 1430.8811 1607.8322 1643.0006 1683.5274 3187.4796 3520.0756 3562.0582
redmass: 9.6859 7.9404 13.1345 18.3780 9.2167 12.3232 3.1412 7.8574 6.9357 7.7388 1.2304 1.9466 5.8441 8.8353 2.2727 1.3650 3.3397 7.0874 5.2325 2.2016 1.8349 3.0383 1.7004 2.1560 6.0773 7.5416 5.6128 1.0953 1.0771 1.0788
irintensity: 1.5028 2.6872 0.6610 0.6366 3.7168 18.3652 15.0652 10.2709 1.3788 43.4648 90.8794 4.3300 17.5712 1.6306 168.8011 18.1481 10.7242 57.3735 9.9643 91.6838 33.9701 68.1410 18.7406 13.3382 5.9472 372.6221 701.3360 1.3162 63.9555 102.8949
temp: 298.150 k
press: 1.00000 atm
elementType: 35 8 8 7 7 6 6 6 6 1 1 1
symmnumber: 1
zpe: 196296.2 jmol-1
zpe.correction: 0.074765 hartree
zpe.thermalcorrener: 0.082458 hartree
zpe.thermalcorrenthalpy: 0.083402 hartree
zpe.thermalcorrgfe: 0.040976 hartree
zpe.sumelectzpe: -427.008730 hartree
zpe.sumelectthermal: -427.001037 hartree
zpe.sumelectthermalent: -427.000093 hartree
zpe.sumelectthermalfe: -427.042519 hartree
dipole: 0.1037 -4.4504 0.0007
dipole: 4.4516
quadrupole: -72.4510 -55.8375 -61.3016
quadrupole: 1.4948 0.0000 0.0015
quadrupole: -9.2543 7.3592 1.8951 1.4948 0.0000 0.0015
hfenergy: -427.0834948 hartree
pointgroup: C01 [X(C4H3Br1N2O2)]
dipole: 0.3207893 1.7217686 -0.0002659 debye
dipolederiv: -0.4497155 0.0679924 0.0000132 0.1495933 -0.0119429 -0.0000259 0.0000981 -0.0000041 0.0382978 -0.6474657 -0.268892 -0.0001999 -0.374257 -0.9720557 -0.0002175 0.000243 0.00036 -0.348039 -1.500134 0.1005109 -0.0001653 0.2028089 -0.5000101 0.0000146 0.0000883 -0.0000478 -0.3835364 -1.2006544 -0.2910006 0.0000616 -0.1941733 -0.4864579 -0.0000483 -0.0002437 -0.0000938 -0.3557223 -1.2542486 -0.1773621 0.0000025 0.6800771 -0.5740938 -0.0000109 -0.000025 0.0000954 -0.3086951 1.0393092 0.2991419 0.0001641 0.2409819 1.3983424 0.000192 -0.0000724 -0.0001666 0.3145887 2.0608919 -0.0464839 0.0002253 -0.470173 1.1232707 0.0000437 0.0000227 0.0000475 0.3399295 0.7050405 -0.1728457 -0.0001113 -0.4166496 -0.6881225 -0.0000172 -0.0000128 -0.0001274 -0.2110294 0.8571298 0.4442732 0.0000556 0.0668978 0.2189081 0.0000828 0.0000525 -0.0000545 0.0275945 0.13032 -0.0209661 -0.0000448 -0.0346356 0.2308132 -0.0000037 -0.0000429 0.0000122 0.3487486 0.1859922 0.0439067 -0.0000141 0.1016781 0.2491626 0.0000033 -0.0000075 0.0000137 0.3625298 0.0735346 0.0217254 0.0000131 0.0478514 0.012186 -0.0000128 -0.0001004 -0.0000347 0.1753333 unknown
polarizability: 124.7021541|2.5498807|75.2011385|-0.0048068|-0.0009983|29.1024941 unknown
InChI: InChI=1S/C4H3BrN2O2/c5-2-1-6-4(9)7-3(2)8/h1,6-7H
charge 0 multiplicity 1
12 atoms
Br -3.04903 0.81175 0.000123
O  -1.407207 -1.954325 0.000251
O  2.941971 -0.202384 0.000063
N  0.737467 -1.031209 -0.000101
N  1.125233 1.282792 -0.000041
C  -0.687961 -0.922085 -0.000495
C  1.700006 -0.006504 0.000147
C  -1.146819 0.480622 -0.000061
C  -0.246967 1.518662 -0.000039
H  1.110294 -1.986885 0.000019
H  1.790543 2.058426 -0.000007
H  -0.562231 2.564341 0.000042
