program: Gaussian 09
title: 000038391
version: EM64L-G09RevD.01
frameworkgroup: C1[X(C17H17Br2N3O2)]
method: RPBEPBE
basis: SDD
operation: Freq
keyword: #p
keyword: freq=noraman
keyword: PBEPBE/SDD
title: #p freq=noraman PBEPBE/SDD
converged: YES YES NO NO
title: Mulliken charges:
elementType: Br Br O O N N N C C C C C C C C C C C C C C C C C H H H H H H H H H H H H H H H H H
charge: -0.007209 -0.006649 -0.426744 -0.234970 -0.161253 -0.089894 -0.118462 -0.394558 -0.395366 0.456253 -0.322215 -0.338472 -0.672538 -0.672646 -0.313277 -0.375441 0.176556 0.081344 0.234779 -0.351949 -0.317722 -0.208094 -0.234364 0.100779 0.259690 0.256437 0.256800 0.260548 0.235787 0.237810 0.286382 0.310207 0.285872 0.309069 0.277461 0.255504 0.253691 0.261797 0.234461 0.234803 0.375788
chargesum: 0.00000
title: Mulliken charges with hydrogens summed into heavy atoms:
elementType: Br Br O O N N N C C C C C C C C C C C C C C C C C
charge: -0.007209 -0.006649 -0.050955 -0.234970 -0.161253 -0.089894 -0.118462 0.121570 0.121982 0.456253 -0.086427 -0.100662 -0.075949 -0.077704 -0.035816 -0.119936 0.176556 0.081344 0.234779 -0.098258 -0.055925 0.026367 0.000440 0.100779
polarizability: 5.71350265e+02 -2.52643950e+01 2.81125635e+02 -1.51172664e+01 -7.18204959e+00 1.31205318e+02
1716.lowfreq: -5.6584 -1.2423 -0.0488 -0.0006 0.0005 2.3624 13.0302 17.7294 20.5242
frequency: 12.7768 17.6699 20.5141 23.6767 38.7659 50.9459 58.6144 70.4361 93.2572 109.1066 120.6466 127.7337 133.9892 158.0838 197.9817 202.3808 212.0147 215.4003 239.6538 277.9601 309.5381 340.9538 370.3765 381.7671 401.6574 420.9613 436.0469 471.5510 498.7619 510.5238 534.7925 544.7923 562.5373 589.3074 594.6609 602.0145 629.1240 637.3306 659.7077 684.3850 717.9190 737.2506 739.4502 769.0877 770.0211 774.3266 776.2364 811.7459 829.7449 835.7190 881.3781 899.7781 938.3431 963.9879 965.9299 968.8674 981.2728 989.8414 991.4585 992.9712 1011.1749 1027.6543 1031.9555 1034.9745 1106.6341 1108.2037 1128.0017 1145.2068 1156.8212 1172.4801 1181.2913 1195.8049 1213.4930 1226.8425 1229.5929 1251.8539 1273.5396 1275.6366 1292.8932 1301.7919 1311.7382 1343.6618 1347.1770 1357.8974 1375.1214 1380.7597 1390.3043 1426.9329 1449.0197 1453.8196 1455.6115 1460.8183 1484.2020 1499.2230 1507.9504 1557.4749 1563.4826 1600.1706 1618.7386 1641.4789 3018.2262 3023.1575 3061.5396 3061.9952 3074.1185 3079.6159 3137.0030 3147.1622 3147.8329 3149.4929 3149.8511 3151.7045 3165.2008 3168.6705 3172.3253 3175.4025 3514.1589
redmass: 7.9881 10.0915 19.4855 10.3480 8.1291 6.6882 4.5852 4.5072 3.5031 5.0164 5.7132 3.0295 5.6059 7.4320 4.5029 5.4138 5.2369 5.8429 4.7765 4.8213 5.3085 6.0851 4.9113 4.3349 4.0523 4.2227 3.8090 4.3939 4.7775 3.7755 3.0451 4.3580 3.3431 3.4597 1.9483 3.3691 6.4297 5.4452 4.6271 3.9183 4.4783 4.5969 4.2002 1.3042 2.8353 1.3589 1.1723 1.2640 5.5968 1.7203 1.9266 3.2717 2.4837 1.4112 1.3670 1.3403 1.3677 3.1168 2.1706 1.9139 1.4698 4.8555 4.2219 2.3069 1.9023 1.6940 1.3156 1.9697 1.7944 1.1026 1.6191 1.6537 2.1042 1.1598 1.1626 2.0527 1.8667 1.3970 1.1757 2.3251 1.4277 1.3857 1.3677 4.8272 5.4343 7.8464 1.9490 2.2574 2.4296 1.1314 1.2678 2.6851 1.1125 1.7317 1.4503 6.7230 6.3345 6.5163 6.4410 8.8020 1.0602 1.0608 1.0568 1.0571 1.1042 1.1042 1.0857 1.1076 1.1069 1.0918 1.0906 1.0902 1.0946 1.0955 1.0966 1.1003 1.0638
irintensity: 0.1113 0.0068 0.3368 0.0835 1.0231 3.6774 0.8100 0.2361 0.6130 0.4057 0.2802 1.2501 1.0706 1.7704 3.1024 6.5212 3.2609 2.0753 0.9534 2.6778 0.6866 13.4325 3.5943 2.5938 7.1013 3.8454 5.0178 4.5442 26.6115 9.5898 30.2428 22.3675 6.6475 78.5999 16.2759 54.8982 13.1794 29.9446 71.6440 82.4322 16.2457 1.9846 11.6910 5.4531 17.9440 70.2353 17.6084 1.6750 6.1347 68.4389 13.5247 4.9675 42.0265 20.3089 3.4727 1.2588 0.8419 73.4449 93.4354 99.8496 6.8462 1.8069 1.3700 15.3971 47.7022 20.1996 15.9427 345.0495 101.8491 4.6395 63.3164 32.0666 34.0179 38.0398 39.1375 12.4757 3.3548 140.5727 6.5654 75.9750 11.5649 178.4127 148.7994 196.1077 1.3964 52.3011 90.0590 2.9720 4.9091 9.0917 15.0058 35.6890 26.0464 94.0311 143.2406 53.6451 24.2942 13.0641 569.5641 190.2005 21.9160 27.2015 5.4646 19.5074 6.9376 6.3321 2.7402 0.7231 24.0702 10.9797 6.3527 9.6273 10.8526 15.0321 23.6545 32.1451 28.0644
temp: 298.150 k
press: 1.00000 atm
elementType: 35 35 8 8 7 7 7 6 6 6 6 6 6 6 6 6 6 6 6 6 6 6 6 6 1 1 1 1 1 1 1 1 1 1 1 1 1 1 1 1 1
symmnumber: 1
zpe: 812782.4 jmol-1
zpe.correction: 0.309572 hartree
zpe.thermalcorrener: 0.333044 hartree
zpe.thermalcorrenthalpy: 0.333989 hartree
zpe.thermalcorrgfe: 0.249953 hartree
zpe.sumelectzpe: -997.857497 hartree
zpe.sumelectthermal: -997.834025 hartree
zpe.sumelectthermalent: -997.833081 hartree
zpe.sumelectthermalfe: -997.917116 hartree
dipole: -0.9260 -0.2395 -1.0621
dipole: 1.4293
quadrupole: -147.2086 -160.9541 -164.7179
quadrupole: -3.2113 -3.3239 2.4940
quadrupole: 10.4183 -3.3272 -7.0910 -3.2113 -3.3239 2.4940
hfenergy: -998.1670696 hartree
pointgroup: C01 [X(C17H17Br2N3O2)]
dipole: 0.3703289 0.25641 0.3366113 debye
polarizability: 572.0571102|-18.6053011|192.2612672|-22.3653458|-72.449535|219.3628402 unknown
InChI: InChI=1S/C17H17Br2N3O2/c18-9-11-22(12-10-19)14-7-5-13(6-8-14)20-21-16-4-2-1-3-15(16)17(23)24/h1-8,23H,9-12H2
charge 0 multiplicity 1
41 atoms
Br 6.319233 2.065915 -2.82588
Br 5.858601 -2.778877 3.027887
O  -3.976144 1.69434 -2.594134
O  -2.775591 -0.283288 -2.421235
N  4.126012 -0.15942 0.109042
N  -1.522445 0.525427 0.069058
N  -2.26577 -0.312775 0.749362
C  5.005075 0.85883 -0.498799
C  4.782582 -1.337745 0.709339
C  2.726542 -0.009217 0.117182
C  1.881919 -0.97705 0.759371
C  2.097018 1.10968 -0.516875
C  5.135036 0.63055 -2.017918
C  4.981515 -1.135277 2.224642
C  0.491321 -0.833787 0.76475
C  0.702042 1.247459 -0.503703
C  -0.124996 0.286161 0.134748
C  -3.666279 -0.109122 0.585573
C  -4.288533 0.402998 -0.599726
C  -4.467659 -0.441437 1.708816
C  -5.68487 0.645466 -0.58823
C  -5.856362 -0.207653 1.697733
C  -6.466701 0.352986 0.550299
C  -3.563414 0.538818 -1.899736
H  4.626773 1.875762 -0.295556
H  6.0040 0.795346 -0.0331
H  5.765253 -1.485393 0.228391
H  4.198539 -2.254571 0.518803
H  2.315632 -1.848774 1.257839
H  2.690374 1.8715 -1.029873
H  5.625038 -0.324982 -2.258618
H  4.171926 0.711167 -2.542566
H  5.660708 -0.29943 2.450978
H  4.030778 -1.014285 2.763947
H  -0.147304 -1.577305 1.251544
H  0.219617 2.099304 -0.993868
H  -3.965433 -0.854217 2.589433
H  -6.154313 1.049601 -1.490163
H  -6.458944 -0.4546 2.578299
H  -7.544907 0.543165 0.534118
H  -3.523772 1.698831 -3.481174
