program: Gaussian 09
title: 000038363
version: EM64L-G09RevD.01
frameworkgroup: C1[X(C13H17NO2)]
method: RPBEPBE
basis: SDD
operation: Freq
keyword: #p
keyword: freq=noraman
keyword: PBEPBE/SDD
title: #p freq=noraman PBEPBE/SDD
converged: YES YES NO NO
title: Mulliken charges:
elementType: O O N C C C C C C C C C C C C C H H H H H H H H H H H H H H H H H
charge: -0.410606 -0.238315 -0.166938 -0.401386 -0.393212 -0.380671 -0.400590 -0.382331 0.466626 -0.380010 -0.384801 0.443656 -0.424077 -0.370141 -0.618917 0.211811 0.220643 0.191542 0.198534 0.206335 0.206143 0.197310 0.194947 0.222928 0.215629 0.200542 0.232454 0.219058 0.228430 0.246342 0.239296 0.236464 0.373303
chargesum: 0.00000
title: Mulliken charges with hydrogens summed into heavy atoms:
elementType: O O N C C C C C C C C C C C C C
charge: -0.037304 -0.238315 -0.166938 0.010799 0.011658 0.022782 0.017286 0.033840 0.466626 -0.147556 -0.165743 0.443656 -0.195647 -0.123799 -0.143157 0.211811
polarizability: 2.31583659e+02 -1.72190887e+00 1.43318554e+02 -7.34028435e+00 -6.76878764e+00 1.02651448e+02
1716.lowfreq: -18.7982 -7.8957 -0.0010 -0.0008 -0.0007 8.1916 18.7353 30.0255 39.6795
frequency: 12.2996 29.3195 39.6546 57.2334 67.4689 122.6370 169.6456 215.4512 238.5228 273.3040 297.5684 347.5037 367.9048 400.8942 409.8893 432.5428 442.7404 460.0552 509.8714 526.8769 555.2297 617.7916 635.7469 671.3893 704.7262 734.6205 799.1528 805.2826 807.0472 827.2372 841.1432 850.7696 854.9090 916.3860 920.4717 926.9201 940.3240 952.1985 956.9824 999.8400 1020.3269 1053.8216 1063.0280 1084.9726 1127.0171 1128.3718 1130.9465 1153.4308 1181.0734 1200.0718 1215.9518 1228.4096 1239.2073 1264.4347 1272.9320 1273.8227 1309.7525 1324.3744 1333.3045 1343.8998 1348.8826 1351.6125 1359.4645 1373.4168 1383.6586 1427.3287 1453.1684 1455.7549 1461.7519 1466.2559 1468.3707 1478.9691 1513.3945 1568.7636 1627.4484 1661.5063 2876.7383 2885.3839 2969.2001 2986.0327 2986.8710 3020.7669 3037.3647 3045.5270 3051.1790 3056.4528 3090.1491 3098.6133 3122.0371 3127.1431 3152.9164 3162.2484 3506.4686
redmass: 4.3984 4.3071 8.1333 3.4657 4.3914 4.8773 3.8268 2.1172 2.5763 4.0355 4.1435 2.6295 2.3952 2.3755 2.8833 3.1532 3.0824 2.6994 2.5942 2.4795 2.9984 1.6407 6.1852 2.3082 3.4032 4.3671 2.0385 1.6763 1.3610 3.3562 2.8912 1.4154 3.4970 2.4538 3.0405 1.9338 1.4686 1.3199 1.3619 2.9419 2.5131 1.9222 1.9278 1.4210 2.0263 2.3257 1.5917 1.2648 1.2009 1.3066 2.0442 2.0530 1.5079 1.2594 1.1734 1.4286 1.7486 1.6320 1.2843 1.3994 1.6727 1.5748 1.5889 1.9719 2.4484 3.5047 1.0930 1.1007 1.0878 1.0954 1.0869 1.0957 2.6629 6.5395 6.3444 8.4020 1.0707 1.0723 1.0634 1.0613 1.0608 1.0610 1.0963 1.1004 1.0938 1.1013 1.0882 1.1016 1.0893 1.0878 1.0947 1.0938 1.0638
irintensity: 0.2182 0.8302 2.8841 1.0644 0.4857 0.0244 0.6464 2.7023 5.4234 0.1865 0.2591 0.3829 10.1685 4.3701 2.0106 0.7865 2.5369 2.7958 15.7228 33.0522 37.4479 118.3240 3.4652 50.3976 15.4230 5.4547 36.9151 15.4901 4.0866 19.7567 1.5814 25.1173 10.5259 9.3339 32.5958 21.9032 12.5698 4.1891 0.1862 3.1505 10.7453 211.2518 4.9614 4.6994 24.9676 13.4832 33.3232 13.7343 31.4763 11.4523 1.8656 23.2368 173.6582 2.6724 15.3518 0.9403 39.4239 21.1307 1.7371 1.5747 16.5516 13.3541 7.1288 40.7447 18.9747 2.6739 7.1809 21.2849 16.6758 43.4575 1.9126 14.0360 192.9674 7.1977 112.8742 235.8379 55.9028 118.5328 40.4876 34.3543 36.9782 22.9240 75.9503 43.4057 5.6208 91.1314 19.2324 5.3765 15.4179 14.7454 22.2242 11.6783 18.5110
temp: 298.150 k
press: 1.00000 atm
elementType: 8 8 7 6 6 6 6 6 6 6 6 6 6 6 6 6 1 1 1 1 1 1 1 1 1 1 1 1 1 1 1 1 1
symmnumber: 1
zpe: 725317.0 jmol-1
zpe.correction: 0.276259 hartree
zpe.thermalcorrener: 0.291217 hartree
zpe.thermalcorrenthalpy: 0.292161 hartree
zpe.thermalcorrgfe: 0.231252 hartree
zpe.sumelectzpe: -709.586656 hartree
zpe.sumelectthermal: -709.571698 hartree
zpe.sumelectthermalent: -709.570754 hartree
zpe.sumelectthermalfe: -709.631663 hartree
dipole: -2.9010 -1.2522 0.8155
dipole: 3.2633
quadrupole: -87.7029 -94.9473 -93.5837
quadrupole: -6.7197 0.3079 -0.5351
quadrupole: 4.3751 -2.8693 -1.5058 -6.7197 0.3079 -0.5351
hfenergy: -709.8629144 hartree
pointgroup: C01 [X(C13H17N1O2)]
dipole: -1.1316529 0.4095227 -0.4472015 debye
polarizability: 231.3614239|3.126117|137.9097089|8.7132239|-15.3322086|108.2825283 unknown
InChI: InChI=1S/C13H17NO2/c15-13(16)10-11-4-6-12(7-5-11)14-8-2-1-3-9-14/h4-7,15H,1-3,8-10H2
charge 0 multiplicity 1
33 atoms
O  4.874811 0.229178 -1.242773
O  4.605036 -1.59771 0.165912
N  -2.119318 0.011393 0.025304
C  -5.0167 -0.292998 -0.408313
C  -4.379984 1.072244 -0.071242
C  -4.166527 -1.425849 0.207002
C  -2.902945 1.140446 -0.519055
C  -2.703873 -1.321542 -0.269306
C  -0.716445 0.144891 0.173213
C  -0.010244 1.290497 -0.30592
C  0.049415 -0.853435 0.854827
C  2.125541 0.441837 0.582136
C  1.378043 1.43015 -0.097084
C  1.433519 -0.706464 1.047542
C  3.631875 0.593322 0.799789
C  4.405128 -0.385865 -0.070216
H  -6.057124 -0.337544 -0.035682
H  -5.061018 -0.42239 -1.509815
H  -4.937189 1.896888 -0.555805
H  -4.426245 1.236266 1.023012
H  -4.196073 -1.355135 1.311712
H  -4.568463 -2.417116 -0.07775
H  -2.854004 1.15938 -1.635706
H  -2.465721 2.084254 -0.151145
H  -2.095777 -2.104689 0.207558
H  -2.669077 -1.508264 -1.370393
H  -0.532835 2.070525 -0.86641
H  -0.445265 -1.737749 1.268585
H  1.887185 2.320172 -0.486962
H  1.987489 -1.49371 1.572949
H  3.893382 0.372101 1.850047
H  3.9541 1.619228 0.56153
H  5.327304 -0.454012 -1.809241
