program: Gaussian 09
title: 000038353
version: EM64L-G09RevD.01
frameworkgroup: C1[X(C13H21NO2S)]
method: RPBEPBE
basis: SDD
operation: Freq
keyword: #p
keyword: freq=noraman
keyword: PBEPBE/SDD
title: #p freq=noraman PBEPBE/SDD
converged: YES YES NO NO
title: Mulliken charges:
elementType: S O O N C C C C C C C C C C C C C H H H H H H H H H H H H H H H H H H H H H
charge: 0.184439 -0.318595 -0.452750 -0.314448 -0.415401 -0.121602 -0.058453 -0.312760 -0.680540 -0.698536 0.478132 -0.389326 -0.338743 -0.231397 -0.224971 -0.244778 -0.851482 0.211969 0.231768 0.211611 0.208622 0.240745 0.238917 0.233480 0.201448 0.212690 0.231639 0.233438 0.198239 0.209389 0.360891 0.251481 0.255790 0.227844 0.231413 0.251645 0.282839 0.265351
chargesum: 0.00000
title: Mulliken charges with hydrogens summed into heavy atoms:
elementType: S O O N C C C C C C C C C C C C C
charge: 0.184439 -0.318595 -0.091860 -0.073703 0.028337 0.090009 0.150169 0.159638 -0.034762 -0.057471 0.478132 -0.389326 -0.087262 0.024393 0.002873 -0.013365 -0.051646
polarizability: 2.04842331e+02 -1.38066562e+01 1.83608299e+02 9.28570781e+00 6.11926652e+00 1.30708577e+02
1716.lowfreq: -12.6870 -2.2366 -0.0016 -0.0016 -0.0010 7.9581 15.4203 20.8610 38.2299
frequency: 13.5392 20.0064 38.1878 51.8021 75.7043 80.8760 104.5518 114.0867 136.8348 148.5271 178.0042 195.9412 203.2900 219.7777 236.2146 256.3695 259.3314 289.3527 309.7525 380.0114 385.0572 421.9828 451.1637 456.6265 459.8792 492.3470 509.9455 538.1094 554.8677 627.3796 642.0808 667.4282 683.7447 726.0852 757.6684 802.8099 825.0792 848.1318 852.6986 912.0499 917.3894 921.6753 938.0007 940.9439 952.8128 968.0855 977.0377 991.6750 997.7543 1025.7324 1045.9242 1069.0253 1098.5591 1101.9351 1126.3092 1130.4858 1151.6443 1170.7293 1175.4185 1216.2090 1227.7503 1233.1517 1250.4545 1263.0800 1310.9092 1321.3787 1329.1399 1337.0276 1344.6748 1362.4127 1373.5939 1377.1125 1378.7777 1388.9388 1424.4160 1442.1966 1445.7458 1448.6194 1463.0993 1464.0537 1467.9038 1470.5528 1478.3731 1481.6325 1485.1762 1579.4375 1590.7863 2932.2341 2967.5609 2972.5149 2977.9387 2987.4016 3013.2548 3018.7146 3036.9350 3061.0930 3064.6758 3070.9277 3072.6446 3093.3821 3133.2056 3135.6430 3143.7495 3145.8445 3159.1362 3171.4934 3413.8610 3490.5425
redmass: 4.6944 4.5889 2.9371 4.2470 3.4317 4.5467 3.6495 3.5164 3.4426 1.0523 2.8955 3.9407 1.0733 3.1833 3.7142 1.4242 2.2856 4.5715 3.1790 4.5077 3.2537 2.3933 3.2003 2.9306 3.3231 2.9618 1.1158 3.8881 4.1821 4.3033 6.8995 1.7438 4.5191 3.3026 1.3346 4.4584 2.4199 2.6771 1.4638 1.4315 1.6294 2.1851 1.5301 1.4046 3.3884 1.1839 1.3162 1.2921 1.9132 5.3294 2.2572 1.9134 1.7748 3.3628 1.6253 2.0862 1.5426 1.0714 2.0531 1.8400 1.7831 1.6209 1.3557 1.4939 1.3763 1.2775 1.1379 1.3236 1.3365 1.3929 1.5954 2.6969 1.3682 1.2236 2.1610 1.0628 1.1652 1.3995 1.0522 1.0568 1.2111 1.3659 1.0794 1.0815 1.0524 6.6939 6.3812 1.0666 1.0357 1.0504 1.0708 1.0553 1.0276 1.0871 1.0913 1.0987 1.1093 1.0974 1.0996 1.1001 1.0853 1.1044 1.1056 1.0899 1.0940 1.1005 1.0736 1.0655
irintensity: 0.0795 0.1579 0.3954 0.0732 2.0491 1.9741 1.2302 0.8747 0.9790 0.2072 8.9566 1.6140 0.3612 2.2986 1.3586 1.6893 2.1984 1.2876 8.7329 0.0205 0.8714 0.1174 2.0529 5.9639 7.7344 9.8822 144.9224 1.0324 9.9858 7.3278 0.3459 61.1105 25.1501 2.0955 98.3950 7.1081 5.9977 10.7579 1.4847 5.9854 14.0870 18.8047 1.5723 7.1421 49.2329 7.1967 0.3024 12.7091 28.7147 12.5249 21.9235 59.2714 11.9780 42.4695 14.7984 16.1313 18.7791 8.7591 75.5789 96.9564 82.9052 24.1501 8.6634 36.5695 9.6453 5.5793 0.3219 2.1039 2.4493 7.2843 27.7164 13.8458 25.0465 29.1245 37.2007 19.3452 17.7599 104.1002 8.9072 2.9215 2.4047 28.6421 6.4619 6.0116 15.6757 1.2708 43.0862 53.2682 29.6693 13.4243 38.0774 20.1531 31.8782 7.9867 66.1424 5.4961 17.7972 84.6749 39.2636 38.6152 1.6087 11.2547 9.9412 8.9386 21.0140 18.0731 1.5366 48.5294
temp: 298.150 k
press: 1.00000 atm
elementType: 16 8 8 7 6 6 6 6 6 6 6 6 6 6 6 6 6 1 1 1 1 1 1 1 1 1 1 1 1 1 1 1 1 1 1 1 1 1
symmnumber: 1
zpe: 835279.3 jmol-1
zpe.correction: 0.318141 hartree
zpe.thermalcorrener: 0.337802 hartree
zpe.thermalcorrenthalpy: 0.338747 hartree
zpe.thermalcorrgfe: 0.267544 hartree
zpe.sumelectzpe: -1109.877582 hartree
zpe.sumelectthermal: -1109.857921 hartree
zpe.sumelectthermalent: -1109.856976 hartree
zpe.sumelectthermalfe: -1109.928179 hartree
dipole: 1.9365 2.4710 -2.2222
dipole: 3.8463
quadrupole: -101.2525 -108.2370 -116.9532
quadrupole: -3.8460 2.2371 8.7613
quadrupole: 7.5617 0.5773 -8.1390 -3.8460 2.2371 8.7613
hfenergy: -1110.195723 hartree
pointgroup: C01 [X(C13H21N1O2S1)]
dipole: 0.6139457 0.637106 1.2276459 debye
polarizability: 208.2640958|-8.2950558|135.6621956|-11.541655|-15.7628054|175.2329152 unknown
InChI: InChI=1S/C13H21NO2S/c1-10(2)14-8-11(15)9-16-12-6-4-5-7-13(12)17-3/h4-7,10-11,14-15H,8-9H2,1-3H3
charge 0 multiplicity 1
38 atoms
S  -2.012255 0.862087 -2.550206
O  -0.534643 -0.444616 -0.261392
O  0.893494 -2.284549 -1.697607
N  3.092299 -0.52527 0.817093
C  2.448826 -0.763504 -0.493296
C  1.376026 -1.875429 -0.375075
C  3.756655 0.793236 1.009029
C  0.203986 -1.46009 0.526542
C  4.936686 1.053862 0.032296
C  4.214288 0.90942 2.477085
C  -1.828644 -0.087855 0.133528
C  -2.623136 0.588427 -0.836456
C  -2.353002 -0.35842 1.420888
C  -3.937768 0.9778 -0.499201
C  -3.672938 0.033884 1.737738
C  -4.471253 0.698877 0.781509
C  -0.584406 2.062145 -2.228032
H  1.959453 0.176615 -0.813359
H  3.147023 -1.062611 -1.306374
H  1.842337 -2.781353 0.056545
H  2.977969 1.561669 0.82427
H  3.726631 -1.295574 1.076918
H  0.588798 -1.021514 1.466114
H  -0.465823 -2.31777 0.727167
H  5.754302 0.328059 0.209234
H  5.348762 2.071146 0.170407
H  4.615165 0.958408 -1.020854
H  3.359677 0.763009 3.160045
H  4.97882 0.142199 2.711072
H  4.662462 1.899657 2.674774
H  0.216632 -1.613537 -1.986148
H  -1.739461 -0.867579 2.170251
H  -4.539774 1.496819 -1.252302
H  -4.071871 -0.180374 2.735384
H  -5.49399 1.003142 1.026044
H  -0.126178 2.260929 -3.209782
H  0.141866 1.587109 -1.553632
H  -0.972718 2.995245 -1.793518
