program: Gaussian 09
title: 000005811
version: EM64L-G09RevD.01
frameworkgroup: C1[X(C7H4Cl2O2)]
method: RPBEPBE
basis: SDD
operation: Freq
keyword: #p
keyword: freq=noraman
keyword: PBEPBE/SDD
title: #p freq=noraman PBEPBE/SDD
converged: YES YES NO YES
title: Mulliken charges:
elementType: Cl Cl O O C C C C C C C H H H H
charge: -0.034864 -0.032047 -0.436952 -0.237673 0.282769 -0.337490 -0.306700 -0.053981 -0.054173 -0.206159 0.131738 0.300966 0.303997 0.287847 0.392720
chargesum: 0.00000
title: Mulliken charges with hydrogens summed into heavy atoms:
elementType: Cl Cl O O C C C C C C C
charge: -0.034864 -0.032047 -0.044232 -0.237673 0.282769 -0.036524 -0.002703 -0.053981 -0.054173 0.081688 0.131738
polarizability: 1.31693241e+02 3.50831918e-01 1.32582411e+02 -9.61411636e-03 -3.59492970e-03 3.71588059e+01
1716.lowfreq: -7.1850 -0.0041 -0.0040 -0.0037 3.5890 5.4539 57.6513 115.6910 139.2283
frequency: 57.6512 115.6889 139.2278 170.4783 185.2407 205.0909 319.8311 335.5327 395.0630 408.6587 462.6759 516.9190 524.5689 601.2704 601.8700 662.0240 735.5074 754.0749 823.7943 877.8764 918.4343 927.0837 980.6096 1035.8680 1097.0373 1102.3045 1159.9648 1249.3343 1316.1333 1382.9604 1409.0737 1429.1584 1565.0997 1596.2886 1646.8502 3179.3445 3186.7158 3196.4542 3535.6646
redmass: 12.2662 9.8584 11.1315 21.1070 4.6832 4.6972 8.9800 16.9833 8.7471 7.8193 3.6576 5.3038 5.9107 4.6614 1.3260 2.5896 4.4462 11.1064 9.0638 1.4737 1.3901 1.4775 6.4107 3.4292 1.4591 1.6343 2.6745 1.1999 2.4884 11.1489 2.9842 3.6988 7.6424 7.4202 9.2106 1.0932 1.0938 1.0937 1.0643
irintensity: 1.3950 0.0044 0.7657 0.2997 0.2773 0.0128 0.2762 1.2345 12.3818 4.6381 3.9062 0.5950 15.4290 61.6443 161.1518 0.4554 51.1618 107.8216 19.3939 26.1139 4.9884 19.1789 2.1977 196.8953 18.1383 10.1134 148.7033 3.4867 138.6801 2.9362 70.4852 22.1582 147.6400 7.7302 228.5156 4.9603 1.3173 4.1022 55.7899
temp: 298.150 k
press: 1.00000 atm
elementType: 17 17 8 8 6 6 6 6 6 6 6 1 1 1 1
symmnumber: 1
zpe: 244082.6 jmol-1
zpe.correction: 0.092966 hartree
zpe.thermalcorrener: 0.102856 hartree
zpe.thermalcorrenthalpy: 0.103801 hartree
zpe.thermalcorrgfe: 0.056232 hartree
zpe.sumelectzpe: -1338.940536 hartree
zpe.sumelectthermal: -1338.930646 hartree
zpe.sumelectthermalent: -1338.929702 hartree
zpe.sumelectthermalfe: -1338.977270 hartree
dipole: -0.7578 1.3024 0.0001
dipole: 1.5068
quadrupole: -69.3530 -82.8152 -77.9110
quadrupole: -6.3954 0.0006 -0.0006
quadrupole: 7.3401 -6.1221 -1.2179 -6.3954 0.0006 -0.0006
hfenergy: -1339.0335024 hartree
pointgroup: C01 [X(C7H4Cl2O2)]
dipole: -0.260175 0.5326745 0.0000534 debye
dipolederiv: -0.2934765 -0.300121 0.000046 -0.3077048 -0.6476354 0.0000677 0.0000507 0.0000897 -0.0552834 -0.3133451 0.3126659 0.0000335 0.3161947 -0.6164105 -0.0000371 0.0000356 -0.0000559 -0.0532961 -0.7385115 0.4592504 0.0000162 0.5743408 -0.9346285 -0.0000041 -0.0002053 0.0003468 -0.4224305 -0.9530087 -0.2854564 0.0001489 -0.1776843 -0.7972561 0.0002436 -0.0001842 -0.0002229 -0.3228478 -0.5976944 0.0035789 0.0000028 -0.0185547 0.1756507 -0.0000118 0.0001699 0.0000117 0.0238149 -0.1414572 0.2456988 -0.0000036 0.0030543 -0.2638197 -0.0000049 0.0001095 -0.0000329 -0.0836295 -0.1013166 -0.2348558 0.0000045 -0.0126683 -0.2867005 0.000009 0.0001104 0.0000575 -0.084996 0.3842685 0.5317183 -0.0000957 0.5605201 0.9992204 -0.0001243 -0.000127 -0.0001669 -0.0534549 0.4501715 -0.5634015 -0.0000777 -0.5782639 0.9485975 0.0000737 -0.0001139 0.0001026 -0.0522867 -0.1314418 0.0068553 0.0000062 0.0074593 -0.4601417 0.0000097 0.0000265 0.0000108 -0.055038 1.9368659 -0.0707871 -0.0000853 -0.2197797 1.3424205 -0.0002437 0.0001406 -0.0001579 0.2384173 0.1309838 -0.0445564 0.000013 -0.016722 0.0686222 0.0000086 0.0000145 0.0000041 0.1704829 0.1322406 0.0292694 0.0000136 0.0325849 0.0669856 -0.0000029 0.0000182 -0.0000008 0.172565 0.0319253 -0.0017199 0.0000269 -0.0018157 0.1133083 0.0000024 0.0000341 0.0000031 0.1701947 0.2037963 -0.0881387 -0.0000493 -0.1609607 0.2917871 0.0000139 -0.0000798 0.0000109 0.4077881 unknown
polarizability: 131.7487035|0.4114879|132.5269488|-0.0098496|-0.0028878|37.1588059 unknown
InChI: InChI=1S/C7H4Cl2O2/c8-5-1-4(7(10)11)2-6(9)3-5/h1-3,10H
charge 0 multiplicity 1
15 atoms
Cl 2.178216 2.814109 -0.000299
Cl 2.291824 -2.733898 -0.000167
O  -2.875498 1.162828 0.00007
O  -2.945781 -1.160159 0.000159
C  -0.785792 -0.020675 0.000389
C  -0.062384 -1.240616 0.000263
C  -0.114099 1.227906 0.000199
C  1.291111 1.226724 -0.000078
C  1.340531 -1.185036 -0.000024
C  2.046105 0.036166 -0.0002
C  -2.27499 -0.102153 0.000704
H  -0.605904 -2.189307 0.000392
H  -0.686113 2.157809 0.000296
H  3.13842 0.058463 -0.000414
H  -3.864047 1.054639 -0.00029
