program: Gaussian 09
title: 000005838
version: EM64L-G09RevD.01
frameworkgroup: C1[X(C12H16N2O3)]
method: RPBEPBE
basis: SDD
operation: Freq
keyword: #p
keyword: freq=noraman
keyword: PBEPBE/SDD
title: #p freq=noraman PBEPBE/SDD
converged: NO YES NO NO
title: Mulliken charges:
elementType: O O O N N C C C C C C C C C C C C H H H H H H H H H H H H H H H H
charge: -0.194454 -0.195905 -0.219381 -0.376827 -0.376248 -0.048825 0.431924 -0.511862 -0.425909 -0.431086 -0.410593 -0.444602 -0.364398 0.134348 0.143676 -0.729135 0.162551 0.222036 0.231566 0.209448 0.208697 0.246425 0.237914 0.208255 0.211329 0.217219 0.217689 0.230340 0.233093 0.228714 0.228066 0.362817 0.363117
chargesum: 0.00000
title: Mulliken charges with hydrogens summed into heavy atoms:
elementType: O O O N N C C C C C C C C C C C C
charge: -0.194454 -0.195905 -0.219381 -0.014009 -0.013131 -0.048825 0.431924 -0.058259 -0.007765 0.053252 0.008991 -0.009693 -0.134058 0.134348 0.143676 -0.039262 0.162551
polarizability: 1.68359903e+02 -2.22014584e+01 1.44820237e+02 4.68730881e-01 -1.23097314e+00 1.26912397e+02
1716.lowfreq: -15.3108 -9.4323 -0.0007 -0.0007 -0.0005 6.6710 26.0672 33.1354 66.8297
frequency: 25.4254 33.0480 66.8202 108.0028 128.0749 137.3273 150.6309 152.5064 180.2448 199.9278 238.8873 258.9232 298.8664 309.7350 326.1031 356.0008 372.5546 429.0951 448.4473 470.4190 478.3095 512.1321 559.2706 619.4632 631.6845 659.0195 685.7344 710.7179 730.0336 757.1269 784.8544 787.4537 800.6351 831.2637 841.2368 886.2590 919.6177 924.5464 950.6056 955.3119 973.1049 993.4446 1054.6449 1072.9971 1078.6468 1098.4230 1120.3392 1124.4564 1134.0593 1141.8511 1178.0424 1207.0283 1242.3677 1267.4225 1281.0315 1295.4853 1317.3728 1325.5557 1337.4027 1340.1409 1348.6814 1365.1631 1366.7548 1375.4601 1376.7480 1397.1286 1452.5681 1458.7869 1460.1154 1470.1577 1475.1510 1478.6779 1487.7543 1615.0339 1651.4702 1677.0199 1680.0228 2951.6711 2955.9310 2982.0768 2982.2844 2983.8776 3005.6399 3010.9605 3021.1456 3045.3697 3053.5524 3067.1654 3081.1242 3096.9515 3136.9501 3515.5130 3517.3201
redmass: 6.5724 3.5431 3.9061 2.6223 4.5125 5.5549 3.2274 3.6447 5.6040 1.2816 2.3448 4.7512 1.8716 2.4261 2.7890 10.9197 9.8693 3.5586 2.6402 3.4169 9.9203 4.1996 5.0116 4.2006 3.8701 2.3705 2.8163 5.4897 2.4939 1.6965 1.4676 1.6112 1.3095 4.0442 1.5377 2.9893 2.2226 1.5727 1.9676 1.9837 2.9332 3.3626 3.3273 2.0819 1.9182 1.8631 3.6871 1.9149 1.6285 1.4896 1.5831 4.4218 1.2868 1.1953 2.9330 1.2645 1.3084 1.5400 1.4786 1.6252 1.5218 2.0261 3.9655 2.0972 1.4538 1.2088 1.0947 1.0830 1.0851 1.0843 1.0933 1.0496 1.0422 7.0817 8.6218 5.3648 7.1046 1.0619 1.0639 1.0466 1.0567 1.0641 1.0917 1.0924 1.0593 1.0987 1.1042 1.1004 1.0980 1.1043 1.0900 1.0756 1.0781
irintensity: 0.9281 0.1469 0.3144 0.0784 4.8189 0.0200 3.7034 4.0485 1.4228 0.6954 0.2106 3.6462 2.1654 1.1203 0.7788 27.3709 6.7504 5.7437 5.4583 8.7364 14.7020 5.8803 9.0411 4.0894 2.2979 3.3072 28.0486 7.9367 4.1403 0.5475 59.4811 171.6369 6.7873 3.0320 6.5421 9.4609 5.9412 7.3033 0.1025 1.4606 2.7965 2.2032 2.9984 4.6611 0.1548 1.6531 9.1437 1.1260 5.2440 2.0636 0.6637 45.6109 1.3453 7.0380 291.0785 14.0871 5.7425 63.8083 6.8588 9.0455 1.1225 74.6731 177.8724 2.2003 2.0384 12.9992 2.9333 13.4439 14.7278 13.4038 6.3136 8.1325 14.7521 289.9925 53.7470 607.9265 7.4304 28.7342 35.0162 45.4104 6.0047 19.0866 41.9197 31.3147 11.6157 56.5042 54.7935 10.6381 32.1291 16.7822 14.7095 83.7604 40.5551
temp: 298.150 k
press: 1.00000 atm
elementType: 8 8 8 7 7 6 6 6 6 6 6 6 6 6 6 6 6 1 1 1 1 1 1 1 1 1 1 1 1 1 1 1 1
symmnumber: 1
zpe: 704865.8 jmol-1
zpe.correction: 0.268469 hartree
zpe.thermalcorrener: 0.284651 hartree
zpe.thermalcorrenthalpy: 0.285596 hartree
zpe.thermalcorrgfe: 0.224278 hartree
zpe.sumelectzpe: -800.810395 hartree
zpe.sumelectthermal: -800.794213 hartree
zpe.sumelectthermalent: -800.793269 hartree
zpe.sumelectthermalfe: -800.854586 hartree
dipole: -1.7056 0.2426 -0.0063
dipole: 1.7228
quadrupole: -98.9769 -101.2014 -110.9638
quadrupole: 6.3561 0.5277 -0.0860
quadrupole: 4.7372 2.5126 -7.2498 6.3561 0.5277 -0.0860
hfenergy: -801.0788642 hartree
pointgroup: C01 [X(C12H16N2O3)]
dipole: -0.6744589 0.0672397 0.0010759 debye
polarizability: 170.1818473|-21.1447158|143.0172069|0.1728181|-0.999414|126.8934824 unknown
InChI: InChI=1S/C12H16N2O3/c1-2-12(8-6-4-3-5-7-8)9(15)13-11(17)14-10(12)16/h6,13-14H,2-5,7H2,1H3
charge 0 multiplicity 1
33 atoms
O  0.613645 0.567161 2.437982
O  0.622242 0.753325 -2.433264
O  3.362559 -2.178946 -0.101339
N  1.932128 -0.800734 1.130303
N  1.926348 -0.721397 -1.230962
C  0.261673 0.725092 0.004874
C  -1.189271 0.159729 -0.012069
C  -1.320019 -1.357603 0.117235
C  -2.715677 -1.866852 -0.31015
C  0.326594 2.286929 0.059607
C  -3.826394 -1.01011 0.335484
C  -3.710021 0.45802 -0.13318
C  -2.278394 0.96324 -0.135001
C  0.935021 0.182045 1.286071
C  0.935529 0.277451 -1.313817
C  1.762354 2.849558 0.119707
C  2.467387 -1.298993 -0.069605
H  -0.54452 -1.866159 -0.490477
H  -1.128033 -1.654422 1.17036
H  -2.806074 -1.810233 -1.413156
H  -2.828167 -2.93039 -0.028251
H  -0.239395 2.610663 0.950248
H  -0.179723 2.671637 -0.842468
H  -3.725013 -1.055025 1.437915
H  -4.826006 -1.411256 0.084902
H  -4.327046 1.116767 0.509898
H  -4.126643 0.564171 -1.157751
H  -2.154519 2.046343 -0.246021
H  2.297796 2.51602 1.027258
H  2.356933 2.561484 -0.766892
H  1.731228 3.953121 0.146197
H  2.339909 -1.184751 1.989473
H  2.333969 -1.041984 -2.11581
