program: Gaussian 09
title: 000005810
version: EM64L-G09RevD.01
frameworkgroup: C1[X(C5H9NO3)]
method: RPBEPBE
basis: SDD
operation: Freq
keyword: #pfreq=noraman
keyword: PBEPBE/SDD
title: #p freq=noraman PBEPBE/SDD
converged: YES YES NO NO
title: Mulliken charges:
elementType: O O O N C C C C C H H H H H H H H H
charge: -0.439641 -0.406981 -0.234273 -0.356026 -0.473234 -0.181790 -0.090912 -0.454295 0.138390 0.233818 0.259341 0.276576 0.239475 0.211659 0.257653 0.287833 0.352340 0.380068
chargesum: 0.00000
title: Mulliken charges with hydrogens summed into heavy atoms:
elementType: O O O N C C C C C
charge: -0.087302 -0.026913 -0.234273 -0.068194 0.019926 0.094786 0.148563 0.015018 0.138390
polarizability: 7.84024844e+01 -1.27188987e+00 6.78714489e+01 -1.39564273e+00 -1.34729674e+00 5.54784111e+01
1716.lowfreq: -19.0775 -4.8811 -0.0012 -0.0011 -0.0007 12.3754 43.6794 54.4575 131.7328
frequency: 43.4095 53.7646 131.7130 192.5549 288.1237 371.8191 395.8933 432.4937 504.7289 560.5274 568.4638 621.8211 670.3478 745.8316 777.5164 796.3509 832.3071 897.3330 933.0643 956.1359 982.9253 1031.6151 1063.5771 1076.5060 1121.4458 1153.0608 1168.8045 1200.4224 1228.8487 1256.3041 1276.2228 1294.4908 1318.7822 1329.9833 1375.4420 1408.9068 1461.4459 1477.8601 1649.5239 2928.8650 3014.2952 3034.4273 3077.4948 3095.2805 3110.7580 3481.4160 3490.5334 3507.0938
redmass: 5.8493 4.2772 4.5298 5.0004 4.1565 2.1801 3.1175 2.9137 1.1160 2.4235 1.8260 2.2231 2.4464 4.0478 2.9031 3.0622 3.7976 2.1174 2.5344 3.4436 2.0551 2.4418 1.9844 1.5476 2.6388 1.4180 1.1833 1.2459 1.6131 1.5379 1.4733 1.3531 1.4969 1.6126 1.1915 1.3797 1.0805 1.0909 8.8821 1.0692 1.0844 1.0639 1.0936 1.0895 1.1020 1.0755 1.0649 1.0642
irintensity: 0.9597 4.1783 8.3026 1.7258 6.1782 0.8997 17.8739 22.4056 102.6680 56.0132 36.8200 172.0934 53.8370 13.0927 3.8118 39.7026 36.7171 11.7674 0.8400 7.7021 34.9554 272.4887 71.6580 10.2042 3.4972 12.1769 38.9871 18.4385 9.4204 11.7695 11.9416 4.1409 7.5520 14.7594 48.8756 15.0390 10.1701 8.6085 212.8671 68.3167 20.4756 15.7474 24.5036 29.9645 15.1259 6.1336 5.7275 18.4322
temp: 298.150 k
press: 1.00000 atm
elementType: 8 8 8 7 6 6 6 6 6 1 1 1 1 1 1 1 1 1
symmnumber: 1
zpe: 379159.6 jmol-1
zpe.correction: 0.144414 hartree
zpe.thermalcorrener: 0.153175 hartree
zpe.thermalcorrenthalpy: 0.154120 hartree
zpe.thermalcorrgfe: 0.109836 hartree
zpe.sumelectzpe: -475.626220 hartree
zpe.sumelectthermal: -475.617458 hartree
zpe.sumelectthermalent: -475.616514 hartree
zpe.sumelectthermalfe: -475.660798 hartree
dipole: 2.1379 -0.1917 -0.2343
dipole: 2.1592
quadrupole: -58.6359 -55.5548 -50.1013
quadrupole: -7.2260 0.7239 2.0165
quadrupole: -3.8719 -0.7908 4.6627 -7.2260 0.7239 2.0165
hfenergy: -475.7706338 hartree
pointgroup: C01 [X(C5H9N1O3)]
dipole: 0.8396517 -0.1187289 -0.0503171 debye
dipolederiv: -0.7278256 0.072827 0.1990388 0.0640422 -0.5220108 0.1253569 0.2695398 0.1298853 -0.4268475 -0.6824299 0.5213686 -0.1077634 0.4707178 -0.9363178 0.0319502 -0.05521 -0.021451 -0.3729907 -0.7125435 -0.2190188 0.1084913 -0.0150353 -0.8708818 0.1170581 0.1296285 0.2041229 -0.3380596 -0.5452057 0.0954063 0.0040347 0.1132307 -0.3897157 -0.0188788 0.1057093 -0.0589656 -0.5891379 -0.0964056 0.0534633 -0.0147025 0.2059103 -0.0171811 -0.0022053 0.0122452 0.0586019 0.0542433 0.0695746 -0.1523143 -0.0100455 -0.3853728 0.2767321 -0.0580951 0.0086095 -0.0550026 0.1745533 0.5965183 -0.0365106 -0.1149111 -0.1227368 0.3011584 -0.0379372 -0.2127914 0.0002755 0.4370323 0.2575644 -0.066717 0.124285 -0.0523457 -0.0260134 0.0149655 0.0500393 -0.0978956 0.401425 1.2150269 -0.1328577 -0.1355298 -0.2331967 1.3677943 -0.2348564 -0.2145207 -0.2841103 0.207074 0.0003916 0.0508245 0.0923191 0.0175033 0.0711161 -0.0343217 0.0805183 -0.0685039 -0.0500066 0.0484415 -0.0486839 0.003109 -0.0495716 -0.056066 0.0470074 -0.0019939 0.0818868 0.0444477 0.0144669 0.0393151 -0.0263734 0.0649914 0.0298768 0.0777947 -0.0565942 0.0699659 -0.0581394 -0.0180475 -0.0220089 -0.0640441 -0.0012074 0.0677805 -0.0465189 -0.0480034 -0.0447351 -0.1095803 -0.0461042 -0.060312 0.1334671 -0.0375872 0.0550295 0.0323804 0.0392861 0.0588941 -0.1930419 -0.0288468 0.1274232 -0.0257569 0.1218843 -0.0331079 0.0270854 -0.0074948 -0.0201161 0.0562023 0.1601574 -0.1262008 -0.1323405 -0.0364706 0.1090613 0.0050532 -0.1046786 0.0920591 0.2682815 0.3460183 -0.0472698 -0.1205377 -0.0121223 0.2949637 -0.098183 -0.0861868 -0.0865607 0.1493167 0.149249 -0.0487342 0.0872596 -0.1126335 0.2777819 0.0523446 0.0918976 0.0416494 0.3452279 unknown
polarizability: 78.3375611|-1.7401298|67.8712561|-0.3839915|-1.9213791|55.5435272 unknown
InChI: InChI=1S/C5H9NO3/c7-3-1-4(5(8)9)6-2-3/h3-4,6-8H,1-2H2
charge 0 multiplicity 1
18 atoms
O  -2.919703 -0.39756 0.169284
O  2.420209 -1.231835 0.144309
O  2.223772 1.035209 -0.328876
N  -0.478827 1.071865 0.642768
C  -0.579584 -1.132299 -0.323289
C  0.277983 -0.200137 0.613718
C  -1.784722 -0.24459 -0.750076
C  -1.203192 1.18147 -0.655593
C  1.708775 -0.02743 0.085159
H  0.00614 -1.456328 -1.200736
H  -0.931905 -2.032995 0.201708
H  0.363614 -0.634615 1.626728
H  -2.178614 -0.503661 -1.74416
H  -0.536852 1.400312 -1.520536
H  -1.994063 1.947188 -0.603602
H  0.084178 1.892216 0.89882
H  -2.637236 0.031309 1.022466
H  3.349428 -1.089418 -0.184294
