program: Gaussian 09
title: 000002471
version: EM64L-G09RevD.01
frameworkgroup: C1[X(C17H20N2O5S)]
method: RPBEPBE
basis: SDD
operation: Freq
keyword: #p
keyword: freq=noraman
keyword: PBEPBE/SDD
title: #p freq=noraman PBEPBE/SDD
converged: YES YES NO NO
title: Mulliken charges:
elementType: S O O O O O N N C C C C C C C C C C C C C C C C C H H H H H H H H H H H H H H H H H H H H
charge: 0.937071 -0.305524 -0.514922 -0.539604 -0.447947 -0.235535 -0.420688 -0.719827 -0.345508 -0.421223 0.421726 0.190692 -0.189104 -0.337930 -0.488044 0.323137 -0.445401 -0.687451 0.330089 0.094583 -0.293026 -0.408724 -0.216732 -0.191175 -0.252799 0.216155 0.218163 0.203569 0.213381 0.337493 0.197607 0.198787 0.296861 0.329725 0.211633 0.221687 0.211882 0.342032 0.336292 0.267256 0.271509 0.233037 0.235133 0.233928 0.387736
chargesum: 0.00000
title: Mulliken charges with hydrogens summed into heavy atoms:
elementType: S O O O O O N N C C C C C C C C C C C C C C C C C
charge: 0.937071 -0.305524 -0.514922 -0.539604 -0.060212 -0.235535 -0.083195 -0.041503 0.088810 -0.004273 0.421726 0.190692 -0.189104 0.058464 -0.191183 0.323137 -0.115676 -0.042249 0.330089 0.094583 -0.025769 -0.137216 0.016305 0.043958 -0.018871
polarizability: 2.84976830e+02 3.37134240e+01 2.94056636e+02 -8.23885619e-01 1.22739324e+01 1.76521668e+02
1716.lowfreq: -3.3164 -0.0010 -0.0007 0.0009 1.6260 4.0352 16.8627 22.3899 31.6064
frequency: 16.5184 22.2226 31.5073 35.7898 42.1671 48.1990 55.0085 57.5730 84.4560 100.0838 116.2854 121.9348 141.9540 152.1231 161.3448 174.8693 183.3102 193.2775 228.2686 229.1249 232.8627 242.6819 246.3218 268.0926 283.1817 313.4141 345.1946 359.3003 395.0630 405.8236 410.4164 428.3207 431.8303 467.8230 485.4029 488.9955 502.6949 559.1874 567.8688 575.2961 601.7393 609.5500 619.2218 636.2890 688.4246 702.3515 736.4072 740.0368 753.1553 762.0246 774.7129 804.2701 806.5140 814.2374 832.3239 844.6159 898.4305 900.0197 902.7521 917.0987 921.3971 944.8361 954.6424 967.2480 986.2006 989.5719 1018.1763 1021.0513 1038.8591 1062.8950 1073.6575 1078.3037 1080.4504 1111.2907 1142.4651 1149.0073 1153.9665 1169.7449 1175.0411 1187.7061 1200.0658 1221.8239 1269.2026 1284.0020 1292.2384 1300.1039 1308.9833 1319.8930 1346.5318 1364.4487 1381.3529 1385.0201 1393.7639 1439.9472 1443.5119 1459.1160 1468.6003 1470.0570 1474.7565 1478.8663 1486.8820 1499.3399 1512.0418 1527.0134 1570.8265 1596.3071 1602.2494 1622.3279 1649.5888 2935.4897 2963.8631 2974.6734 2977.4002 2978.7708 3010.0337 3039.1783 3074.0267 3078.7057 3134.9357 3144.1610 3159.1552 3167.2626 3168.6457 3175.8715 3190.4361 3361.4830 3528.9765 3531.8922 3561.9675
redmass: 5.0986 4.3088 5.0461 4.8331 6.4150 4.6364 7.1007 1.8566 3.8010 8.6214 2.6783 4.4213 4.6114 2.6517 1.8666 4.3868 4.3348 5.4950 2.0878 1.4035 5.3427 4.4561 5.5872 4.5703 5.5666 8.0118 5.4918 4.3156 4.4215 2.1271 1.7809 5.8326 4.3903 4.5057 3.4616 4.8718 3.8185 4.5708 5.4657 3.3723 4.5265 5.3341 1.8586 5.0019 2.4003 5.6695 2.4438 1.4091 1.8624 3.1161 4.2167 1.8569 1.1483 10.2586 1.2603 6.2855 1.9032 1.4836 1.4124 4.0497 1.5701 1.1713 4.9862 1.3703 4.8772 1.3826 2.1798 3.5911 2.8887 2.6234 1.6840 1.5344 2.2276 2.3393 3.0102 1.9086 1.5744 1.1065 1.5017 1.9395 2.0091 1.3058 1.3547 1.1539 1.0597 1.7193 1.3324 2.0484 1.8585 2.0582 2.3820 8.8059 1.2252 3.5090 2.7302 2.3180 2.2229 1.0780 1.0655 1.0434 1.0748 1.1188 3.3929 1.0980 4.8171 6.2744 6.7394 7.7883 8.7544 1.0584 1.0599 1.0640 1.0372 1.0947 1.1007 1.1044 1.1009 1.0993 1.0852 1.0892 1.0929 1.0960 1.0923 1.1011 1.0913 1.0413 1.1001 1.0642 1.0770
irintensity: 0.6350 0.2328 1.4254 0.8101 3.2911 0.1446 0.9498 0.0465 0.7517 0.2801 0.8671 2.9461 0.9175 2.7288 32.9865 2.8203 7.1456 3.5903 10.1742 4.2798 2.0042 1.2042 3.0327 3.0163 6.1734 4.8137 11.2179 1.7637 47.6626 31.7566 61.0243 6.7805 32.5393 101.6733 20.6917 26.6314 9.8716 8.4743 23.1846 56.1036 39.8809 8.8566 65.8488 11.1855 22.5521 23.6938 43.2294 0.0464 56.2858 66.4906 1.0563 51.8706 0.6727 130.3968 5.8608 50.2012 7.3110 5.4998 1.8355 74.4234 21.5882 0.2360 51.1026 0.8148 2.8977 0.2557 13.7218 20.1780 248.9463 67.0465 9.8187 11.7223 1.4303 21.7273 44.2329 167.7715 7.0393 1.0950 40.0341 93.7658 105.3521 0.3936 23.2885 1.4188 0.4823 41.2068 2.7763 176.5133 34.7711 2.4758 45.9555 6.6136 9.4474 20.5528 4.9237 36.6824 75.3085 6.0308 1.3264 13.0788 22.5319 68.1197 175.6382 20.6067 121.4825 38.3272 33.1052 259.9698 197.3007 44.2146 4.0879 52.4689 33.8589 28.8129 0.5965 44.1065 74.6672 46.4822 0.8107 10.7488 20.8135 7.8679 26.0896 9.2996 4.4495 25.0111 21.6894 51.9334 49.2140
temp: 298.150 k
press: 1.00000 atm
elementType: 16 8 8 8 8 8 7 7 6 6 6 6 6 6 6 6 6 6 6 6 6 6 6 6 6 1 1 1 1 1 1 1 1 1 1 1 1 1 1 1 1 1 1 1 1
symmnumber: 1
zpe: 904988.5 jmol-1
zpe.correction: 0.344692 hartree
zpe.thermalcorrener: 0.371192 hartree
zpe.thermalcorrenthalpy: 0.372136 hartree
zpe.thermalcorrgfe: 0.284888 hartree
zpe.sumelectzpe: -1541.466052 hartree
zpe.sumelectthermal: -1541.439552 hartree
zpe.sumelectthermalent: -1541.438607 hartree
zpe.sumelectthermalfe: -1541.525855 hartree
dipole: -9.3734 -0.9927 2.8466
dipole: 9.8462
quadrupole: -173.0956 -132.6010 -158.3873
quadrupole: -7.0859 9.1324 -5.4386
quadrupole: -18.4010 22.0936 -3.6927 -7.0859 9.1324 -5.4386
hfenergy: -1541.8107435 hartree
pointgroup: C01 [X(C17H20N2O5S1)]
dipole: 3.6364379 0.6270338 -1.1787896 debye
polarizability: 303.0757436|-31.435535|276.2927106|-0.24937|-10.149383|176.1866803 unknown
InChI: InChI=1S/C17H20N2O5S/c1-2-3-9-19-14-10-12(17(20)21)11-15(25(18,22)23)16(14)24-13-7-5-4-6-8-13/h4-8,10-11,19-20H,2-3,9,18H2,1H3
charge 0 multiplicity 1
45 atoms
S  -2.93855 -1.993309 0.65664
O  0.083825 -1.453619 0.833802
O  -2.617785 -2.535933 2.151268
O  -4.472706 -1.777538 0.159026
O  -2.236068 4.313445 -0.761204
O  -4.248375 3.155665 -0.710992
N  1.403953 1.03073 0.415284
N  -2.168137 -3.09782 -0.600598
C  2.17432 2.272578 0.264741
C  3.67589 2.009307 0.487666
C  0.03455 0.948507 0.249522
C  -0.638615 -0.308461 0.428833
C  -2.035234 -0.366701 0.320627
C  4.523267 3.294967 0.359929
C  -0.765627 2.077031 -0.087875
C  -2.168563 1.968277 -0.220438
C  -2.833619 0.735137 -0.004591
C  6.028811 3.037469 0.581769
C  1.019638 -2.062217 -0.064266
C  -3.002863 3.148401 -0.576735
C  1.011976 -1.833234 -1.456952
C  1.932815 -2.953605 0.539196
C  1.960139 -2.510473 -2.256441
C  2.869879 -3.62491 -0.277088
C  2.891185 -3.402759 -1.674848
H  2.019523 2.692589 -0.751467
H  1.81863 3.036952 0.9895
H  3.826339 1.570876 1.496025
H  4.029553 1.258412 -0.247696
H  1.904665 0.196956 0.723357
H  4.367745 3.738194 -0.644537
H  4.163753 4.045189 1.092815
H  -0.30345 3.054447 -0.23873
H  -3.92019 0.64828 -0.097526
H  6.420978 2.310912 -0.154291
H  6.613566 3.969437 0.480302
H  6.218224 2.628642 1.591924
H  -2.936433 -3.607787 -1.069128
H  -1.490507 -3.719717 -0.129188
H  0.268702 -1.167044 -1.904947
H  1.891464 -3.111575 1.62123
H  1.961659 -2.344473 -3.339189
H  3.580975 -4.320964 0.18071
H  3.619474 -3.924859 -2.303978
H  -2.849276 5.061499 -0.992463
