program: Gaussian 09
title: 000005816
version: EM64L-G09RevD.01
frameworkgroup: C1[X(C9H13NO3)]
method: RPBEPBE
basis: SDD
operation: Freq
keyword: #p
keyword: freq=noraman
keyword: PBEPBE/SDD
title: #p freq=noraman PBEPBE/SDD
converged: YES YES NO NO
title: Mulliken charges:
elementType: O O O N C C C C C C C C C H H H H H H H H H H H H H
charge: -0.470933 -0.441274 -0.489911 -0.322887 -0.166428 0.410360 -0.397108 -0.504870 -0.398694 0.198342 -0.340612 0.127875 -0.619128 0.188794 0.239724 0.175990 0.306155 0.293718 0.256761 0.215365 0.339005 0.232685 0.195847 0.222976 0.379511 0.368737
chargesum: 0.00000
title: Mulliken charges with hydrogens summed into heavy atoms:
elementType: O O O N C C C C C C C C C
charge: -0.131928 -0.061763 -0.121174 -0.066126 0.022365 0.410360 0.018606 -0.198715 -0.104976 0.198342 -0.125247 0.127875 0.032380
polarizability: 1.58193503e+02 3.11142957e+00 1.23662687e+02 -6.70170769e+00 3.23014090e+00 6.64946711e+01
1716.lowfreq: -2.7671 -0.0007 -0.0007 -0.0005 5.7404 15.3446 24.2256 64.4726 105.6005
frequency: 22.7695 64.4448 105.5951 119.9784 160.0719 191.0306 201.3598 227.9553 255.2965 268.4160 272.1352 282.3888 322.9354 346.4018 417.2017 437.2758 466.7201 481.7075 506.0538 532.9739 570.6700 630.2067 669.7287 701.5011 727.6262 759.6927 802.1370 904.0621 907.9907 951.5777 961.9689 984.2872 987.6094 1048.1442 1073.1141 1107.0370 1123.1369 1137.5995 1144.3862 1164.2856 1179.9521 1190.1101 1228.6351 1233.0026 1269.9439 1295.7314 1307.2462 1350.5546 1377.0527 1402.3414 1435.7129 1449.1181 1465.6035 1466.6221 1472.6915 1493.4735 1499.9934 1608.1272 1631.6630 2815.9950 2882.3757 2886.8085 3019.0077 3035.0864 3079.7050 3113.9615 3143.2617 3194.3736 3443.2623 3527.2641 3562.5507 3623.2779
redmass: 4.8169 3.3041 3.0556 2.2987 3.8133 2.7573 5.1816 1.8215 1.1744 1.2297 1.8480 4.3707 5.0540 6.0228 4.8786 3.0988 3.5351 1.1176 4.0686 5.9255 5.4196 4.5460 1.2776 4.5338 3.5775 5.6055 1.3705 2.5341 1.5933 2.1303 1.5122 2.4508 2.0416 3.1409 2.2721 1.3369 1.4515 1.7526 1.2823 2.9855 1.4009 1.3358 1.5379 1.4928 2.5958 1.1967 1.4434 1.4680 1.5621 6.4016 1.1480 1.2042 1.7034 1.2784 1.2709 1.0895 2.8786 7.3587 6.6906 1.0718 1.0553 1.0819 1.0762 1.0876 1.1000 1.0891 1.0958 1.0918 1.0744 1.0648 1.0659 1.0665
irintensity: 0.1906 1.3557 6.8570 0.5783 2.0075 0.6566 6.3286 10.3961 48.2887 250.8318 22.4931 2.3782 3.3932 11.6505 7.1989 9.4187 45.2331 132.1537 4.3072 12.3562 0.7826 11.2052 107.5218 2.7693 5.1144 51.9791 51.6146 29.1854 28.2305 10.0590 1.2582 81.4839 16.4596 45.7539 172.1131 4.6239 67.8407 18.7550 4.9086 27.9987 34.4241 71.4015 35.9986 38.2769 110.0078 2.2131 67.7360 14.7139 65.8016 7.7984 2.9966 14.8856 8.3547 4.7875 2.8941 34.4370 129.6940 37.3893 2.3974 145.3366 178.1516 64.3946 39.8845 21.5624 36.4949 14.4906 14.9032 2.7580 0.6604 74.2825 4.3170 48.0536
temp: 298.150 k
press: 1.00000 atm
elementType: 8 8 8 7 6 6 6 6 6 6 6 6 6 1 1 1 1 1 1 1 1 1 1 1 1 1
symmnumber: 1
zpe: 548631.2 jmol-1
zpe.correction: 0.208963 hartree
zpe.thermalcorrener: 0.222702 hartree
zpe.thermalcorrenthalpy: 0.223646 hartree
zpe.thermalcorrgfe: 0.168393 hartree
zpe.sumelectzpe: -630.146446 hartree
zpe.sumelectthermal: -630.132707 hartree
zpe.sumelectthermalent: -630.131763 hartree
zpe.sumelectthermalfe: -630.187015 hartree
dipole: 3.4455 -3.0497 -0.7803
dipole: 4.6671
quadrupole: -60.6650 -71.4626 -79.1600
quadrupole: 13.7328 -2.4229 -1.7788
quadrupole: 9.7642 -1.0334 -8.7308 13.7328 -2.4229 -1.7788
hfenergy: -630.3554085 hartree
pointgroup: C01 [X(C9H13N1O3)]
dipole: 1.1319739 0.5869079 1.3212354 debye
dipolederiv: -0.292595 -0.072012 0.1014812 -0.118445 -0.6365743 -0.1473475 0.146732 -0.1507041 -0.7278525 -0.9814219 -0.2612544 -0.5436694 -0.2926067 -0.4064694 -0.0473479 -0.6237551 -0.0477063 -0.6336426 -1.4133292 0.2654885 0.2567471 0.2875582 -0.4224562 0.0777609 0.2630661 0.0801152 -0.2511325 -0.7131806 -0.2576471 0.0196947 -0.2583182 -0.3368902 -0.1490724 0.0810023 -0.1378223 -0.5535951 0.3934238 -0.0456146 -0.0774387 -0.049615 0.4668623 0.0534505 -0.1667753 0.0887193 0.5964896 0.1801489 0.0157431 0.088306 -0.1854453 -0.0485893 0.058245 -0.0611364 0.0468938 -0.0073107 0.3162326 -0.0766945 -0.0286467 -0.0686196 0.0532708 0.0035593 0.005379 0.1110608 0.4786738 -0.2001751 -0.1126056 -0.174113 0.0731332 -0.1124773 0.0704473 0.0226179 0.0601799 -0.0413157 -0.2448952 -0.0292984 -0.0352461 0.0265553 -0.1320762 0.0570151 0.0800811 0.037435 -0.112824 0.7252476 0.2253239 0.5324227 0.3919071 0.1017525 0.1520658 0.8158754 0.128701 0.451912 -0.0860865 0.0213262 0.072985 -0.0435211 -0.1194908 0.0880268 -0.0631207 0.1004293 -0.0001741 1.0456731 -0.2663434 -0.2204101 -0.4549789 0.0611125 0.0036419 -0.5167672 0.0347536 -0.0449511 0.4652241 0.1275853 -0.0505875 0.2975823 0.3880527 0.111035 -0.0460053 0.0282542 0.1787548 -0.1074165 0.0904378 -0.0443689 0.1087639 -0.1051426 0.081701 -0.0171685 0.0823754 -0.1352258 0.0901477 0.0710671 -0.025715 0.068734 -0.0827332 0.0709411 -0.0330913 0.0222526 0.0084284 -0.2526814 0.0516632 0.18777 0.0440687 0.0041913 -0.1005753 0.0856017 -0.0963662 -0.1770799 0.1701455 0.0020983 -0.0042598 0.0063414 0.1285662 -0.0629368 -0.0058946 -0.0658136 0.0600104 0.1967038 0.0084694 -0.0542558 -0.0165295 0.1148459 -0.0484662 -0.0659961 -0.049728 0.0654404 0.2235038 0.0874758 -0.110525 0.0371414 -0.0231543 0.0532631 -0.0745513 -0.0368772 0.1596218 0.0325727 0.0531128 0.0633248 0.0616227 0.0873882 -0.1248832 0.0642985 -0.1221176 -0.0294863 -0.0385724 0.115198 0.0481451 0.0774175 0.390424 0.030197 -0.0413266 0.0151205 0.3119354 0.0118504 0.1183803 -0.0329181 0.0423609 -0.1119565 0.0253535 -0.0102136 0.0874976 0.0863699 -0.3019476 -0.1104321 0.0577426 -0.0566657 -0.005709 -0.063779 0.2105936 0.02407 0.003308 0.050306 -0.050946 -0.051741 -0.0275325 0.0807263 -0.0034496 -0.1098806 -0.0461216 -0.1707414 0.3362998 0.0800086 0.1159229 0.0728446 0.3405414 -0.060983 0.1083912 -0.0597341 0.3133582 0.3948214 -0.0505301 -0.0906472 -0.0237537 0.3259851 -0.1278625 -0.0479562 -0.1348671 0.1710289 unknown
polarizability: 158.2145998|-3.3680353|82.4139742|5.9805205|25.9519441|107.7222871 unknown
InChI: InChI=1S/C9H13NO3/c1-10-5-9(13)6-2-3-7(11)8(12)4-6/h2-4,9-13H,5H2,1H3
charge 0 multiplicity 1
26 atoms
O  1.720449 -1.351249 -1.877556
O  -3.161424 -0.873175 -1.744346
O  -3.854033 0.527807 0.459133
N  3.032635 0.46947 1.133835
C  1.659985 -0.861062 -0.489323
C  0.211543 -0.454932 -0.218477
C  2.696685 0.280839 -0.289995
C  -0.812454 -0.844063 -1.116234
C  -0.116877 0.284218 0.946574
C  -2.148467 -0.493017 -0.853249
C  -1.46081 0.63579 1.212129
C  -2.470737 0.245816 0.314198
C  3.915375 1.618101 1.411608
H  1.938129 -1.693586 0.20251
H  2.28081 1.2262 -0.684521
H  3.600603 0.040126 -0.912469
H  -0.568651 -1.404629 -2.020604
H  0.687277 0.585123 1.626149
H  3.377878 -0.400246 1.561795
H  -1.711837 1.208988 2.11419
H  2.648926 -1.63183 -2.077838
H  3.395319 2.555459 1.141349
H  4.882625 1.597746 0.852581
H  4.142486 1.660164 2.491362
H  -4.029177 -0.535275 -1.398279
H  -4.034758 1.051219 1.27558
