program: Gaussian 09
title: 000005787
version: EM64L-G09RevD.01
frameworkgroup: C1[X(C7H4Cl2O2)]
method: RPBEPBE
basis: SDD
operation: Freq
keyword: #p
keyword: freq=noraman
keyword: PBEPBE/SDD
title: #p freq=noraman PBEPBE/SDD
converged: YES YES NO NO
title: Mulliken charges:
elementType: Cl Cl O O C C C C C C C H H H H
charge: 0.020744 -0.023632 -0.451143 -0.217092 0.360785 -0.268161 -0.289967 -0.196200 -0.212364 -0.086534 0.123889 0.293970 0.287891 0.266654 0.391159
chargesum: 0.00000
title: Mulliken charges with hydrogens summed into heavy atoms:
elementType: Cl Cl O O C C C C C C C
charge: 0.020744 -0.023632 -0.059984 -0.217092 0.360785 -0.268161 0.004003 0.091691 0.054290 -0.086534 0.123889
polarizability: 1.56670927e+02 4.01314271e+00 1.11404849e+02 2.35183130e-02 1.91084697e-02 3.74105414e+01
1716.lowfreq: -3.5402 -2.7502 -0.0037 -0.0029 -0.0028 9.7232 27.4199 79.9626 161.3642
frequency: 27.3947 79.9596 161.3638 172.6549 194.3311 264.2236 298.3459 327.6604 380.3016 435.7689 495.4709 523.9222 536.7294 587.1789 637.1666 668.9972 671.3389 750.6535 791.2700 840.7549 871.1552 981.6647 985.5769 1045.3629 1090.6913 1142.8246 1159.5969 1253.2018 1307.7875 1358.5247 1380.5131 1456.0642 1558.2753 1588.8226 1653.8594 3174.3425 3184.0752 3194.2016 3535.5734
redmass: 14.0350 7.2533 5.9564 12.3155 18.6130 6.2187 16.1097 8.5835 11.1000 2.9851 6.3516 7.1838 4.5452 1.3205 5.9621 3.5356 6.2219 4.1943 7.9565 1.4960 1.4141 1.3605 6.2148 2.9491 3.3612 1.4362 1.7378 1.3551 2.3428 3.5356 7.6204 2.6057 8.8212 7.0905 9.1002 1.0897 1.0934 1.0967 1.0643
irintensity: 0.8401 0.1656 0.1204 0.7515 0.7113 1.5624 0.3375 0.6224 4.9580 21.5064 51.0228 14.8074 14.4800 80.7298 9.3537 74.7908 14.0702 17.7840 64.4902 31.6198 19.5381 1.2456 308.2503 43.3646 24.3145 70.5063 50.5800 6.2392 65.5990 19.6902 12.2982 62.3118 44.8577 158.4871 285.3980 0.4830 1.0750 1.2331 55.0705
temp: 298.150 k
press: 1.00000 atm
elementType: 17 17 8 8 6 6 6 6 6 6 6 1 1 1 1
symmnumber: 1
zpe: 243844.4 jmol-1
zpe.correction: 0.092875 hartree
zpe.thermalcorrener: 0.102771 hartree
zpe.thermalcorrenthalpy: 0.103715 hartree
zpe.thermalcorrgfe: 0.055653 hartree
zpe.sumelectzpe: -1338.933189 hartree
zpe.sumelectthermal: -1338.923294 hartree
zpe.sumelectthermalent: -1338.922349 hartree
zpe.sumelectthermalfe: -1338.970412 hartree
dipole: -0.7467 -2.4797 -0.0070
dipole: 2.5897
quadrupole: -78.7264 -70.3364 -77.9781
quadrupole: -7.7750 -0.0461 -0.0307
quadrupole: -3.0461 5.3439 -2.2978 -7.7750 -0.0461 -0.0307
hfenergy: -1339.0260641 hartree
pointgroup: C01 [X(C7H4Cl2O2)]
dipole: -0.2195163 0.9947767 0.0184601 debye
dipolederiv: -0.1544774 0.224225 -0.0008101 0.2450265 -0.6189369 -0.0038718 -0.0003722 -0.0043567 -0.018453 -0.9188456 0.0233446 -0.0369494 -0.0208177 -0.1165128 -0.0025678 -0.0378422 -0.0006845 -0.050282 -0.603175 -0.4357874 -0.0211586 -0.5590422 -1.0923319 -0.0453199 -0.0258368 -0.0395183 -0.4380349 -1.0033715 0.2119411 -0.0219081 0.1480709 -0.6512446 -0.0056174 -0.024797 -0.0031598 -0.3103111 -0.8436937 -0.0637147 -0.0396646 0.0085787 -0.3084257 -0.0087371 -0.0379241 -0.0118532 0.0369149 0.5706552 -0.4865694 0.015545 -0.0987168 0.9705595 0.0200218 0.0259009 0.003375 -0.0518485 0.2977899 0.0594017 0.0187245 -0.2091501 -0.0051119 -0.0068171 0.0107492 0.0048684 -0.0951537 -0.5965658 0.3018338 -0.0156961 0.2363558 -0.2665106 0.0053828 -0.0171617 0.0084237 -0.0655588 -0.5032583 -0.1978851 -0.0214845 -0.1845779 -0.089501 -0.00717 -0.0212409 -0.0077551 -0.1198198 1.4106387 -0.0113735 0.0623865 0.00449 0.3682279 0.0103385 0.0625122 0.0095534 -0.0417266 1.9279594 0.2913636 0.0792447 0.2751003 1.3927908 0.0505304 0.0806534 0.0499529 0.246578 0.110043 -0.0227673 -0.0028067 -0.0260309 0.0342507 -0.0042393 -0.0025674 -0.0042782 0.1627333 0.0788105 -0.0258385 -0.0046159 -0.0340187 0.0419294 -0.0046397 -0.0048576 -0.0042138 0.1701599 0.0519087 0.0595213 -0.0036659 0.0565043 0.0165971 -0.001388 -0.0035457 -0.0012137 0.170834 0.1755818 0.0723046 -0.0071407 0.1582278 0.32422 0.0040947 -0.0036699 0.0008597 0.4039683 unknown
polarizability: 155.5939146|-7.4819175|112.2296198|4.9047519|1.5922418|37.6627831 unknown
InChI: InChI=1S/C7H4Cl2O2/c8-4-1-2-5(7(10)11)6(9)3-4/h1-3,10H
charge 0 multiplicity 1
15 atoms
Cl 0.782983 -2.660868 0.003124
Cl -3.969558 0.081645 -0.135839
O  2.581297 1.624006 0.194143
O  2.986903 -0.656523 0.137534
C  0.670135 0.186251 0.067212
C  -0.038385 -1.047033 0.006145
C  -0.097809 1.387112 0.063807
C  -1.447684 -1.083619 -0.056045
C  -1.501788 1.3763 0.0025
C  -2.157584 0.130196 -0.056849
C  2.157134 0.278895 0.133481
H  0.440869 2.336014 0.111113
H  -1.971237 -2.041387 -0.102341
H  -2.071898 2.308543 0.001108
H  3.574821 1.633067 0.235507
