program: Gaussian 09
title: 000038274
version: EM64L-G09RevD.01
frameworkgroup: C1[X(C16H33NO2)]
method: RPBEPBE
basis: SDD
operation: Freq
keyword: #p
keyword: freq=noraman
keyword: PBEPBE/SDD
title: #p freq=noraman PBEPBE/SDD
converged: YES YES NO NO
title: Mulliken charges:
elementType: O O N C C C C C C C C C C C C C C C C H H H H H H H H H H H H H H H H H H H H H H H H H H H H H H H H H
charge: -0.469702 -0.427262 -0.164002 0.042748 -0.229251 -0.113166 -0.434636 0.146309 -0.435305 -0.435481 -0.390378 -0.367937 -0.361036 -0.712544 -0.354038 -0.347574 -0.699593 -0.700158 -0.699501 0.168241 0.226886 0.231271 0.192390 0.237477 0.211440 0.231194 0.199398 0.194803 0.202665 0.201528 0.193573 0.179276 0.204445 0.193568 0.206916 0.217994 0.215034 0.202468 0.192212 0.195193 0.193400 0.359598 0.228432 0.206866 0.224224 0.208197 0.216245 0.209712 0.210625 0.216423 0.213541 0.367273
chargesum: 0.00000
title: Mulliken charges with hydrogens summed into heavy atoms:
elementType: O O N C C C C C C C C C C C C C C C C
charge: -0.110105 -0.059989 -0.164002 0.210989 -0.002365 0.118105 -0.004769 0.146309 0.007329 -0.041280 0.013815 0.004912 0.036976 -0.072600 0.040642 0.041018 -0.040071 -0.066003 -0.058913
polarizability: 2.15138421e+02 3.19088844e+00 1.88803243e+02 -5.48229365e+00 -3.24093553e-01 1.68101132e+02
1716.lowfreq: -18.6934 -13.0862 -5.9906 -0.0008 0.0002 0.0004 10.0204 20.9671 30.7217
frequency: -3.8114 19.8743 30.5094 48.0406 50.1894 53.7304 61.9086 76.0690 88.5645 114.0075 118.3563 125.7132 138.9757 141.4131 169.4083 175.3382 198.4601 216.0783 218.4997 226.1304 235.4817 240.0777 259.0646 263.2849 285.8055 290.6997 297.2490 341.6576 358.3989 379.3518 404.6083 429.8722 443.1100 468.1984 475.4973 530.8909 610.4789 621.1267 658.7757 725.2974 727.8312 750.7453 768.7797 780.9130 782.0604 817.6389 834.2320 879.7716 891.9522 910.4973 912.8116 917.5979 930.4795 952.1992 960.8719 995.8078 1002.9561 1033.7489 1034.9891 1047.3052 1051.1988 1059.2630 1071.4270 1076.1442 1078.6855 1086.0615 1101.0746 1109.1667 1132.9558 1139.4456 1153.4122 1195.2404 1208.5525 1212.3711 1224.4524 1234.8685 1245.9293 1253.3409 1255.3986 1265.8005 1268.9298 1278.1855 1286.1666 1288.8334 1291.7779 1299.5060 1307.1404 1311.9999 1327.5506 1335.6720 1338.0631 1346.9861 1353.8357 1356.1342 1361.5741 1379.1053 1388.1483 1389.0011 1392.0464 1394.9733 1459.0593 1463.4689 1464.9815 1466.8886 1469.2221 1471.4814 1474.0210 1475.2176 1476.3974 1477.1334 1480.7513 1481.4382 1483.1504 1485.4459 1486.4064 1489.3878 1592.3852 2944.6792 2958.0782 2958.7442 2963.6188 2966.8213 2969.8388 2970.8811 2971.6218 2973.5561 2974.0379 2975.3550 2978.9299 2985.0462 2985.2102 2987.6280 2987.8865 2995.1536 3013.8680 3020.0380 3032.3148 3033.4667 3039.6735 3042.3533 3065.8435 3066.9332 3068.9977 3069.5942 3070.3211 3072.6358 3076.9162 3089.2891 3393.2945 3564.2786
redmass: 3.5850 2.6104 1.8316 2.6542 3.3054 3.3956 4.1768 1.6103 2.4970 2.4083 2.4806 2.6910 2.7162 2.5747 1.6142 2.6682 2.8833 1.5073 1.2586 1.2970 1.7491 1.9329 2.8888 2.7768 3.5057 4.0586 3.6118 3.1529 2.7710 1.4353 1.5678 3.3159 1.6721 2.7595 2.2701 2.8777 4.0424 3.6002 3.2106 1.1075 1.0962 1.6176 1.2903 1.3680 1.4686 1.6901 2.0606 2.1009 1.9004 1.5054 1.5862 1.5534 2.7245 2.0700 2.0842 3.6876 2.0929 1.4490 2.7593 2.7963 2.2859 1.7650 2.2819 2.2536 1.9996 1.9602 2.1730 2.0396 2.0505 2.5180 2.3781 1.9593 1.4681 1.4648 1.3102 1.2909 1.2722 1.2426 1.2886 1.2624 1.2573 1.2457 1.0781 1.0868 1.2265 1.2309 1.3926 1.3193 1.3848 1.4166 1.4312 1.5276 1.5822 1.5646 1.2874 1.3496 1.2161 1.2109 1.2154 1.2085 1.0679 1.0670 1.0760 1.0683 1.0678 1.0446 1.0690 1.0636 1.0430 1.0423 1.0532 1.0647 1.0618 1.0662 1.0817 1.0895 6.6051 1.0586 1.0628 1.0757 1.0601 1.0591 1.0391 1.0370 1.0613 1.0395 1.0702 1.0654 1.0626 1.0621 1.0407 1.0830 1.0908 1.0968 1.1010 1.1017 1.1004 1.0993 1.1007 1.1019 1.0998 1.1007 1.0993 1.1005 1.0992 1.0993 1.0994 1.1000 1.0646 1.0674
irintensity: 0.1821 0.0328 0.0583 0.1071 0.5584 0.0358 0.4416 0.0593 0.0416 0.3689 0.1488 0.1983 0.0276 0.2008 0.7275 1.1627 0.6928 1.2394 0.3154 0.0839 0.0331 0.5270 3.4289 2.4171 0.9686 11.9473 0.6880 18.3695 0.0628 65.1711 9.6453 3.2195 74.8187 21.6863 37.1537 3.5155 3.5175 12.5217 4.1319 11.9490 9.7397 16.9685 0.5138 6.3643 12.1374 17.0784 16.1890 3.6663 22.3378 2.0813 43.3893 21.5855 47.1836 15.5960 3.1530 0.8594 44.8724 0.8470 1.0571 0.7610 1.9831 10.2067 10.3005 1.9348 4.9559 13.7726 1.5402 20.5224 8.2233 6.6696 0.1204 7.6084 1.0612 12.8324 11.2009 43.2724 24.8425 16.8611 2.7372 1.5830 6.0888 1.9446 1.2585 0.4855 4.6053 0.5369 5.4951 4.2937 2.5484 0.6509 2.7298 1.7289 0.8803 2.3979 11.5722 63.0046 13.6674 13.8540 11.7810 15.5939 0.9047 0.7118 1.8382 0.8866 2.9150 12.9803 3.7713 1.7421 12.6267 11.9579 4.0043 2.5040 11.1746 7.7727 24.0370 19.8704 4.0992 19.7132 5.0824 10.4069 14.3335 26.9953 35.1873 30.4509 41.8632 43.2342 16.3221 65.0565 94.6548 35.5430 22.6575 6.4234 29.9111 1.1035 1.9153 11.8107 1.9374 10.2601 94.4137 41.9078 78.2933 83.3268 55.6971 109.0359 35.1826 48.2329 43.2832 45.2089 68.1497 46.7718
temp: 298.150 k
press: 1.00000 atm
elementType: 8 8 7 6 6 6 6 6 6 6 6 6 6 6 6 6 6 6 6 1 1 1 1 1 1 1 1 1 1 1 1 1 1 1 1 1 1 1 1 1 1 1 1 1 1 1 1 1 1 1 1 1
symmnumber: 1
zpe: 1219219.3 jmol-1
zpe.correction: 0.464376 hartree
zpe.thermalcorrener: 0.488862 hartree
zpe.thermalcorrenthalpy: 0.489806 hartree
zpe.thermalcorrgfe: 0.409334 hartree
zpe.sumelectzpe: -833.057793 hartree
zpe.sumelectthermal: -833.033307 hartree
zpe.sumelectthermalent: -833.032363 hartree
zpe.sumelectthermalfe: -833.112835 hartree
dipole: -1.3132 0.8216 -1.4988
dipole: 2.1555
quadrupole: -116.2495 -121.4343 -122.4264
quadrupole: -0.0808 -5.9396 0.7956
quadrupole: 3.7872 -1.3976 -2.3896 -0.0808 -5.9396 0.7956
hfenergy: -833.522169 hartree
pointgroup: C01 [X(C16H33N1O2)]
dipole: 0.4598518 -0.0079283 0.7124712 debye
polarizability: 194.2030884|-10.4138037|207.0202188|5.0842466|-11.1753747|170.8194889 unknown
InChI: InChI=1S/C16H33NO2/c1-5-9-11-13(7-3)15(17-19)16(18)14(8-4)12-10-6-2/h13-14,16,18-19H,5-12H2,1-4H3
charge 0 multiplicity 1
52 atoms
O  -0.406447 -1.444258 -2.173107
O  2.527651 -3.108235 0.015978
N  1.397265 -2.491504 -0.682922
C  -1.567441 -0.673416 -0.140421
C  -0.201167 -0.756762 -0.892889
C  1.521249 -0.793768 1.179664
C  -2.547208 0.227916 -0.941775
C  0.94085 -1.407391 -0.091868
C  -2.162578 -2.085625 0.10746
C  1.606877 0.757551 1.102025
C  0.773611 -1.24912 2.477217
C  -2.236576 1.740853 -0.876688
C  2.588986 1.280173 0.028413
C  -3.221888 -2.116675 1.231058
C  -3.254263 2.596582 -1.665931
C  2.623403 2.823204 -0.055611
C  0.805055 -2.768444 2.74479
C  -2.948972 4.108648 -1.603661
C  3.627906 3.345719 -1.105025
H  -1.381897 -0.186733 0.840973
H  0.124818 0.275733 -1.133885
H  2.554306 -1.188987 1.261909
H  -3.574727 0.065917 -0.557941
H  -2.543166 -0.11157 -1.996056
H  -1.350157 -2.794757 0.360328
H  -2.601602 -2.449412 -0.840586
H  0.600706 1.19331 0.934924
H  1.93648 1.126585 2.094629
H  -0.274805 -0.894722 2.452502
H  1.258768 -0.722233 3.323702
H  -1.220936 1.941476 -1.277986
H  -2.226221 2.073433 0.183435
H  2.321611 0.869434 -0.966902
H  3.607415 0.900463 0.252186
H  -2.778829 -1.834613 2.205756
H  -3.654927 -3.128104 1.340848
H  -4.055814 -1.419244 1.027946
H  -3.265228 2.261509 -2.72282
H  -4.272769 2.406556 -1.269387
H  1.606777 3.19715 -0.296863
H  2.877389 3.238081 0.94148
H  0.190369 -2.246568 -2.155852
H  0.305691 -3.333726 1.938097
H  0.291436 -3.005133 3.69499
H  1.843636 -3.137906 2.80903
H  -2.959679 4.472981 -0.558761
H  -3.691807 4.696382 -2.173917
H  -1.94957 4.328579 -2.024912
H  4.656247 3.012248 -0.869734
H  3.632013 4.450369 -1.147357
H  3.377361 2.969676 -2.114847
H  2.756799 -3.86212 -0.586035
