program: Gaussian 09
title: 000038257
version: EM64L-G09RevD.01
frameworkgroup: C1[X(C14H25N)]
method: RPBEPBE
basis: SDD
operation: Freq
keyword: #pfreq=noraman
keyword: PBEPBE/SDD
title: #p freq=noraman PBEPBE/SDD
converged: NO YES NO NO
title: Mulliken charges:
elementType: N C C C C C C C C C C C C C C H H H H H H H H H H H H H H H H H H H H H H H H H
charge: -0.361375 -0.141166 -0.178077 -0.081650 -0.088102 -0.027580 -0.470680 -0.442060 -0.468474 -0.450051 -0.456318 -0.349696 -0.379891 -0.342260 -0.691622 0.204216 0.183605 0.190521 0.191111 0.182729 0.193896 0.195950 0.219331 0.184268 0.193626 0.197642 0.215735 0.185164 0.191920 0.192292 0.234916 0.169116 0.200109 0.209244 0.172895 0.191782 0.193582 0.215377 0.208538 0.211437
chargesum: 0.00000
title: Mulliken charges with hydrogens summed into heavy atoms:
elementType: N C C C C C C C C C C C C C C
charge: -0.126459 0.063050 0.005528 0.108871 0.103010 0.155149 -0.080834 -0.038460 -0.077206 -0.049152 -0.072107 0.019529 0.002249 0.043104 -0.056271
polarizability: 1.76194025e+02 5.65166528e-01 1.34813397e+02 -9.85530895e-01 2.94874282e-01 1.31984126e+02
1716.lowfreq: -13.6322 -0.0007 -0.0004 -0.0002 6.5809 20.1490 38.9723 52.5048 62.2255
frequency: 37.5178 52.2769 61.8300 108.0606 112.2271 167.8526 208.9466 230.3584 233.3145 293.6322 305.1461 351.1848 368.3183 393.9073 416.9948 419.9284 428.0607 479.0920 547.1896 620.4772 628.6001 653.4664 696.9282 737.6869 758.7291 791.3674 800.6915 811.5219 811.9714 866.0869 868.5961 890.0114 904.7570 915.6466 932.7038 942.9374 961.4678 974.6224 1011.3056 1020.8840 1043.0890 1049.6795 1051.7934 1069.8496 1078.0393 1081.9038 1098.4614 1101.1238 1111.9004 1113.1574 1117.0702 1125.2949 1140.5174 1149.6406 1185.1119 1210.7724 1217.7465 1248.5522 1263.4179 1269.3167 1274.7422 1284.3630 1291.7439 1295.9329 1301.3000 1304.8665 1322.6203 1325.3017 1326.8832 1333.3572 1342.6484 1345.5979 1353.1482 1359.5228 1363.8933 1370.1702 1377.4246 1390.6407 1446.1410 1452.2370 1457.0789 1461.4232 1463.7351 1468.4965 1474.0463 1476.2415 1477.1983 1485.6929 1496.4026 2807.4006 2835.2731 2947.4068 2954.3220 2956.6683 2959.4159 2963.7593 2968.0930 2968.2792 2972.9365 2973.8300 2987.4437 2990.9127 2998.8401 3003.5507 3007.4633 3013.0567 3019.8929 3022.7203 3037.1327 3038.2320 3042.0622 3069.7702 3072.2628 3402.8212
redmass: 2.8558 1.8511 3.4409 2.6506 1.8375 3.1243 3.5632 1.6163 1.6782 2.4201 2.0033 2.6948 2.0094 4.2390 1.7975 1.7697 3.2305 3.0751 3.6344 2.9091 3.8516 2.6207 2.1220 1.0756 4.0361 2.6156 1.3715 2.8239 2.1008 1.5915 1.5782 2.0031 1.9332 2.0850 1.5121 1.4961 2.1979 2.2306 3.7896 3.2914 2.1560 2.0942 2.0268 1.6068 2.0072 1.8861 1.5207 1.5863 1.0158 1.0182 1.0356 2.1388 1.4174 3.9892 1.2732 1.2972 1.0978 1.5052 1.5041 1.4188 1.2701 1.0938 1.7370 1.9233 1.9642 2.1775 1.4137 1.3409 1.3143 1.3839 1.4442 1.4887 1.4106 1.4936 1.5477 1.5715 1.5252 1.2266 1.0832 1.1283 1.1306 1.1239 1.1273 1.0686 1.0666 1.0901 1.0431 1.0726 1.0915 1.0811 1.0716 1.0766 1.0634 1.0625 1.0619 1.0637 1.0635 1.0616 1.0368 1.0697 1.0829 1.0826 1.0832 1.0841 1.0973 1.1030 1.1016 1.1018 1.1016 1.1001 1.0991 1.1007 1.0994 1.0736
irintensity: 0.1026 0.2762 0.0984 0.4315 0.8195 0.2184 1.1314 0.7151 1.4390 0.6832 0.1823 1.6934 0.7439 0.9431 0.1901 0.5383 0.0552 6.0734 13.7652 10.2761 3.4167 17.8555 24.3060 8.6327 1.4355 1.8677 1.4705 1.4527 0.4074 1.2095 0.3576 7.1754 1.7492 0.0495 3.1491 1.4696 8.9884 1.3932 2.3890 0.2768 0.8597 0.5119 4.6764 5.5945 2.0092 1.5464 7.8976 4.4390 0.7844 0.1527 2.4201 9.5160 2.1361 61.1021 0.5673 8.7256 0.2709 0.4719 0.6140 10.7015 0.6321 0.5876 0.0488 0.7140 0.2277 0.3735 0.1309 1.1833 0.0536 3.9064 4.4951 0.7054 3.4213 6.6483 5.2002 11.9268 3.3415 10.2606 3.9268 2.3437 11.5925 21.2639 19.6463 1.0490 0.7326 9.6243 12.0080 11.1427 6.6675 82.2620 120.5211 28.3441 11.9497 24.5023 26.4359 33.3016 19.3781 36.8338 35.4526 136.5212 121.3777 162.7289 62.2969 42.9619 2.4591 4.0253 69.8683 66.3591 56.2154 11.3458 60.9437 86.5624 54.3315 3.5327
temp: 298.150 k
press: 1.00000 atm
elementType: 7 6 6 6 6 6 6 6 6 6 6 6 6 6 6 1 1 1 1 1 1 1 1 1 1 1 1 1 1 1 1 1 1 1 1 1 1 1 1 1
symmnumber: 1
zpe: 961074.6 jmol-1
zpe.correction: 0.366054 hartree
zpe.thermalcorrener: 0.380417 hartree
zpe.thermalcorrenthalpy: 0.381361 hartree
zpe.thermalcorrgfe: 0.324590 hartree
zpe.sumelectzpe: -602.036684 hartree
zpe.sumelectthermal: -602.022322 hartree
zpe.sumelectthermalent: -602.021377 hartree
zpe.sumelectthermalfe: -602.078148 hartree
dipole: -0.4029 0.1731 -0.8498
dipole: 0.9563
quadrupole: -93.0883 -94.2218 -94.0263
quadrupole: -0.2921 0.7655 1.6408
quadrupole: 0.6905 -0.4430 -0.2475 -0.2921 0.7655 1.6408
hfenergy: -602.4027383 hartree
pointgroup: C01 [X(C14H25N1)]
dipole: -0.1572496 -0.1089117 -0.3239721 debye
polarizability: 176.1825644|0.6152057|134.3811015|-1.1657522|-1.0853447|132.4278818 unknown
InChI: InChI=1S/C14H25N/c1-2-3-4-15-14-12-6-10-5-11(8-12)9-13(14)7-10/h10-15H,2-9H2,1H3
charge 0 multiplicity 1
40 atoms
N  -1.093109 -0.569318 -0.053136
C  0.732868 1.170851 -0.216159
C  1.262428 -1.296227 -0.434094
C  3.096557 0.424823 -0.773985
C  2.148028 0.018478 1.547286
C  0.186165 -0.205002 -0.709324
C  2.016709 1.513475 -1.020526
C  1.063433 1.102421 1.298221
C  2.547082 -0.953351 -1.235663
C  1.597987 -1.357954 1.081788
C  3.430807 0.365235 0.7427
C  -2.275729 0.217822 -0.465755
C  -3.567698 -0.357547 0.14699
C  -4.830377 0.44091 -0.249058
C  -6.124344 -0.147866 0.353072
H  -0.028346 1.956081 -0.395476
H  0.869075 -2.279882 -0.77048
H  4.011628 0.670803 -1.349109
H  2.387494 -0.025672 2.628472
H  0.051837 -0.129691 -1.82268
H  2.399657 2.504906 -0.705451
H  1.785373 1.581434 -2.103283
H  0.145862 0.85149 1.862691
H  1.421753 2.091756 1.648551
H  3.309784 -1.740917 -1.071283
H  2.327214 -0.930984 -2.322435
H  0.69113 -1.613969 1.660783
H  2.351346 -2.151726 1.262819
H  4.214417 -0.397484 0.928501
H  3.837372 1.340817 1.078718
H  -1.276412 -1.578692 -0.160211
H  -2.385373 0.264891 -1.581319
H  -2.148859 1.262161 -0.118973
H  -3.461391 -0.374882 1.249629
H  -3.690097 -1.414228 -0.17594
H  -4.915233 0.468857 -1.354678
H  -4.713695 1.493384 0.080877
H  -7.0120 0.443266 0.061792
H  -6.283267 -1.187907 0.010444
H  -6.075475 -0.163362 1.458185
