program: Gaussian 09
title: 000005786
version: EM64L-G09RevD.01
frameworkgroup: C1[X(C7H3Cl3O2)]
method: RPBEPBE
basis: SDD
operation: Freq
keyword: #p
keyword: freq=noraman
keyword: PBEPBE/SDD
title: #p freq=noraman PBEPBE/SDD
converged: YES YES NO NO
title: Mulliken charges:
elementType: Cl Cl Cl O O C C C C C C C H H H
charge: 0.032613 0.012802 0.025196 -0.450134 -0.212343 0.390604 -0.311153 -0.270238 -0.080014 -0.180799 -0.081145 0.124241 0.315071 0.290376 0.394926
chargesum: 0.00000
title: Mulliken charges with hydrogens summed into heavy atoms:
elementType: Cl Cl Cl O O C C C C C C C
charge: 0.032613 0.012802 0.025196 -0.055208 -0.212343 0.390604 -0.311153 0.044832 -0.080014 0.109577 -0.081145 0.124241
polarizability: 1.73208865e+02 -3.26064797e+00 1.26305701e+02 -3.23956002e-02 6.36577142e-03 4.01779069e+01
1716.lowfreq: -5.4267 -2.3150 -0.0007 0.0009 0.0015 5.7767 27.7000 58.2043 119.0513
frequency: 27.6384 58.2028 119.0506 163.3387 181.3094 198.7658 203.0163 291.7866 323.0036 324.7364 347.3109 440.3318 469.7759 517.1683 553.0338 594.5342 605.8484 647.7089 678.9420 679.4244 749.9381 844.4249 867.5820 924.2354 992.8994 1051.0548 1127.7711 1156.6575 1248.6638 1298.0985 1321.5633 1371.4456 1443.5597 1542.8524 1579.9968 1654.8435 3184.0756 3194.9876 3537.0291
redmass: 13.4958 18.7063 10.1700 11.3734 29.2505 5.5204 21.6864 17.1264 9.8950 23.5192 11.9491 3.0572 9.7050 5.8602 2.7636 7.9016 1.7394 6.2177 4.2549 6.4171 5.3811 10.7026 1.4478 1.4546 5.9241 4.0677 1.6903 3.1349 1.2383 2.8643 5.4025 11.7488 3.0168 10.1864 8.0035 9.3120 1.0931 1.0923 1.0644
irintensity: 1.1494 0.0673 0.0376 0.8055 0.1949 0.0883 0.4839 0.3414 0.3195 0.0585 0.1948 25.3978 29.3278 22.5861 20.6931 48.2013 115.3937 22.8475 24.3532 7.1647 12.7558 10.2628 15.3375 21.1432 373.3483 41.7664 28.6654 108.7804 2.2062 82.1558 30.1591 7.4217 111.2145 26.7270 81.4614 275.2799 2.0317 7.3984 60.6833
temp: 298.150 k
press: 1.00000 atm
elementType: 17 17 17 8 8 6 6 6 6 6 6 6 1 1 1
symmnumber: 1
zpe: 218417.8 jmol-1
zpe.correction: 0.083191 hartree
zpe.thermalcorrener: 0.094388 hartree
zpe.thermalcorrenthalpy: 0.095332 hartree
zpe.thermalcorrgfe: 0.043896 hartree
zpe.sumelectzpe: -1798.315894 hartree
zpe.sumelectthermal: -1798.304697 hartree
zpe.sumelectthermalent: -1798.303753 hartree
zpe.sumelectthermalfe: -1798.355189 hartree
dipole: -0.2794 1.0866 0.0060
dipole: 1.1219
quadrupole: -97.2017 -80.0751 -89.4757
quadrupole: 8.9097 0.0417 -0.0110
quadrupole: -8.2842 8.8424 -0.5582 8.9097 0.0417 -0.0110
hfenergy: -1798.3990848 hartree
pointgroup: C01 [X(C7H3Cl3O2)]
dipole: 0.0254735 0.4397417 -0.0286285 debye
dipolederiv: -0.2620615 -0.3051492 0.0118743 -0.3311518 -0.5168888 0.0224547 0.0133318 0.0227434 -0.0093416 -0.3480858 -0.3226631 0.0108696 -0.3664594 -0.4354603 0.0156812 0.0134978 0.0167093 -0.0181044 -0.7695066 0.1582357 -0.0292557 0.2096055 -0.0979338 0.0107092 -0.0324466 0.0093851 -0.0123222 -0.4445982 0.2842041 -0.0193061 0.4393364 -1.229469 0.064355 -0.0304431 0.0606305 -0.4360902 -1.0629147 -0.1572348 -0.0076897 -0.0465284 -0.5852192 0.0182415 -0.0159547 0.0154677 -0.3059299 -0.7734179 0.1524177 -0.0306916 0.1083187 -0.2459991 0.0215024 -0.0277351 0.0224877 0.0485127 0.6446521 0.5682739 -0.0159745 0.2136289 0.8166911 -0.048729 0.0061881 -0.039598 -0.072826 0.1012911 -0.2580688 0.0196414 0.0499873 -0.1892925 0.0096132 0.0001217 0.0015706 -0.051677 0.1957045 0.799467 -0.0415769 0.6966218 0.4996942 -0.0154205 -0.0353488 -0.0127389 -0.0590121 -0.5719283 -0.1625207 -0.0039125 -0.1577829 -0.1731922 0.0039759 -0.0042788 0.0039059 -0.0412291 1.1195451 -0.3941328 0.0536639 -0.3022159 0.2082643 -0.0226108 0.048188 -0.0250147 -0.0310928 1.8088972 -0.3171915 0.0586438 -0.396241 1.4819247 -0.0937055 0.0654943 -0.0909259 0.2490698 0.1399187 -0.0100232 -0.0000346 -0.0093231 0.0710264 0.0055254 0.0002047 0.0055814 0.1668782 0.0787508 0.0026347 -0.0024486 0.0177046 0.0354178 0.008477 -0.0033189 0.008142 0.1672134 0.1437535 -0.038249 -0.0038027 -0.1255006 0.3604364 -0.0000697 0.0024995 0.0016538 0.4059513 unknown
polarizability: 170.1438573|12.0726548|128.9877616|2.6240207|-5.1353888|40.5608542 unknown
InChI: InChI=1S/C7H3Cl3O2/c8-4-2-6(10)5(9)1-3(4)7(11)12/h1-2,11H
charge 0 multiplicity 1
15 atoms
Cl -1.538409 -2.647989 0.070047
Cl 2.679157 2.20175 -0.114685
Cl 3.656108 -0.937549 0.10003
O  -2.449288 1.906096 -0.239186
O  -3.304153 -0.245115 -0.117151
C  -0.86719 0.117386 -0.080939
C  -0.419037 -1.230022 0.012711
C  0.119035 1.142095 -0.117569
C  1.488588 0.845389 -0.064013
C  0.956141 -1.535125 0.066305
C  1.909918 -0.500531 0.028169
C  -2.307075 0.507691 -0.142566
H  -0.214008 2.179282 -0.189416
H  1.284264 -2.574766 0.137687
H  -3.419053 2.122208 -0.276925
