program: Gaussian 09
title: 000005784
version: EM64L-G09RevD.01
frameworkgroup: C1[X(C7H4Cl2O2)]
method: RPBEPBE
basis: SDD
operation: Freq
keyword: #p
keyword: freq=noraman
keyword: PBEPBE/SDD
title: #p freq=noraman PBEPBE/SDD
converged: YES YES NO NO
title: Mulliken charges:
elementType: Cl Cl O O C C C C C C C H H H H
charge: 0.021134 -0.035813 -0.449470 -0.214801 0.370639 -0.307492 -0.266154 -0.097325 -0.179510 -0.207964 0.126399 0.311967 0.267655 0.267852 0.392885
chargesum: 0.00000
title: Mulliken charges with hydrogens summed into heavy atoms:
elementType: Cl Cl O O C C C C C C C
charge: 0.021134 -0.035813 -0.056585 -0.214801 0.370639 -0.307492 0.045812 -0.097325 0.088145 0.059888 0.126399
polarizability: 1.51923284e+02 2.91069999e+00 1.10835274e+02 -3.52582266e-02 -8.56688162e-03 3.73742271e+01
1716.lowfreq: -0.0024 -0.0004 0.0011 4.2649 8.5373 11.6055 23.9425 86.4595 146.1896
frequency: 23.9187 86.4560 146.1869 160.7123 206.6843 292.3045 310.5573 325.9919 370.4296 425.9545 463.5451 505.0662 564.9708 596.0402 607.2738 676.3481 677.8319 755.1040 813.2850 821.9782 923.7235 958.5351 989.6876 1041.8453 1090.7698 1131.6097 1159.0846 1254.2717 1302.4256 1368.2327 1375.1015 1450.2524 1560.1127 1591.7050 1654.4231 3165.7164 3184.1223 3197.1585 3535.7281
redmass: 13.5056 9.2059 5.2790 11.5848 18.0947 7.1600 25.3692 8.5732 9.2333 3.1124 6.2945 3.5965 8.0947 1.2778 5.3767 6.4150 4.2021 5.6436 7.7555 1.3549 1.4602 1.3503 5.7131 4.9026 2.1352 1.6974 1.5806 1.3763 2.1745 3.4259 10.6203 2.6334 7.2202 7.9423 9.2428 1.0890 1.0978 1.0927 1.0643
irintensity: 1.0987 0.9110 0.5734 1.1297 0.3844 0.7799 0.2075 0.4220 5.7151 13.3735 10.6561 4.8429 48.6280 150.3430 39.3635 6.8060 22.1716 12.0041 11.9503 41.0058 14.7931 0.9848 268.3873 77.6499 41.3905 45.0349 63.9214 8.4296 68.7231 8.0297 15.8979 102.7816 20.4340 12.5119 242.6425 0.2060 0.7173 6.1470 53.9706
temp: 298.150 k
press: 1.00000 atm
elementType: 17 17 8 8 6 6 6 6 6 6 6 1 1 1 1
symmnumber: 1
zpe: 243829.7 jmol-1
zpe.correction: 0.092870 hartree
zpe.thermalcorrener: 0.102771 hartree
zpe.thermalcorrenthalpy: 0.103715 hartree
zpe.thermalcorrgfe: 0.055546 hartree
zpe.sumelectzpe: -1338.932410 hartree
zpe.sumelectthermal: -1338.922509 hartree
zpe.sumelectthermalent: -1338.921565 hartree
zpe.sumelectthermalfe: -1338.969734 hartree
dipole: 1.4960 -0.2354 -0.0081
dipole: 1.5144
quadrupole: -87.6368 -62.1614 -77.9721
quadrupole: -5.2949 0.0488 -0.0026
quadrupole: -11.7134 13.7620 -2.0486 -5.2949 0.0488 -0.0026
hfenergy: -1339.0252798 hartree
pointgroup: C01 [X(C7H4Cl2O2)]
dipole: -0.58285 0.1235752 0.0032862 debye
dipolederiv: -0.3725303 0.3564876 0.016147 0.337618 -0.4099992 -0.0188469 0.0147324 -0.0181168 -0.0178657 -0.6125007 0.3167586 0.0117439 0.3648335 -0.3347093 -0.0119541 0.0145771 -0.0125152 -0.0557196 -0.3222232 -0.1094107 -0.0060529 -0.2157113 -1.3134587 -0.0598541 -0.0136872 -0.0587074 -0.434437 -1.0306743 0.0861019 -0.0001561 -0.0527151 -0.5646031 -0.0179703 -0.0098108 -0.0169004 -0.3070096 -0.5800941 -0.2096966 -0.0201317 -0.1868687 -0.2609819 -0.0217476 -0.018871 -0.0218133 0.0597226 0.6809486 -0.6414781 -0.0276853 -0.265302 0.5956154 0.0357216 -0.0047217 0.0312287 -0.0746832 -0.1170684 0.2714998 0.0156005 0.0504227 -0.1322836 -0.0029697 0.0016233 -0.0005222 -0.0695254 0.866838 -0.6675161 -0.0276319 -0.6532038 0.3125969 0.0147271 -0.0268506 0.0145476 -0.0740304 -0.3035401 0.1915459 0.0085298 0.1211247 -0.0182542 0.0059039 0.0042527 0.0068347 -0.0930079 -0.0829894 0.1128618 0.0066086 0.09549 0.023678 0.0073499 0.0056366 0.0074456 -0.079729 1.5440892 0.3059388 0.0299178 0.3652242 1.6002109 0.0929964 0.0356133 0.0917297 0.2447053 0.143582 0.0259518 0.0012266 0.0154534 0.0640393 -0.0059225 0.0010373 -0.0058082 0.1683503 0.0804492 0.0119562 -0.0003447 -0.0131981 -0.0244537 -0.0112603 -0.0018839 -0.0108511 0.1639463 -0.0083117 -0.0403409 -0.0045644 -0.0325439 0.0861956 -0.0050412 -0.0040065 -0.0051407 0.1647274 0.1140253 -0.0106601 -0.0032071 0.0693763 0.3764076 -0.0011321 0.002359 -0.0014111 0.4045561 unknown
polarizability: 144.7332235|-15.9157745|117.7469726|0.3566668|4.59733|37.6525892 unknown
InChI: InChI=1S/C7H4Cl2O2/c8-4-1-2-6(9)5(3-4)7(10)11/h1-3,10H
charge 0 multiplicity 1
15 atoms
Cl 1.711992 -2.449392 -0.054287
Cl -3.374823 1.475067 0.112995
O  1.748245 2.191701 0.226738
O  2.98658 0.237199 0.110875
C  0.522756 0.13744 0.082589
C  0.337946 -1.271014 -0.00299
C  -0.637026 0.964723 0.117408
C  -1.914597 0.392274 0.067319
C  -0.957019 -1.831343 -0.052088
C  -2.09665 -1.002716 -0.017554
C  1.866022 0.790067 0.136997
H  -0.503793 2.046035 0.183318
H  -1.071579 -2.916766 -0.117118
H  -3.09955 -1.436614 -0.055703
H  2.662595 2.581039 0.259702
