program: Gaussian 09
title: 000038237
version: EM64L-G09RevD.01
frameworkgroup: C1[X(C16H13ClN2O)]
method: RPBEPBE
basis: SDD
operation: Freq
keyword: #p
keyword: freq=noraman
keyword: PBEPBE/SDD
title: #p freq=noraman PBEPBE/SDD
converged: NO YES NO NO
title: Mulliken charges:
elementType: Cl O N N C C C C C C C C C C C C C C C C H H H H H H H H H H H H H
charge: -0.045875 -0.214927 -0.428107 -0.053755 -0.243035 0.222266 -0.022174 0.300136 0.124786 0.313342 -0.332753 -0.705938 -0.402098 -0.141862 -0.211066 -0.364943 -0.378360 -0.235062 -0.229951 -0.237228 0.258113 0.325445 0.298149 0.213450 0.245759 0.218427 0.246938 0.263302 0.252909 0.271470 0.230297 0.230253 0.232094
chargesum: 0.00000
title: Mulliken charges with hydrogens summed into heavy atoms:
elementType: Cl O N N C C C C C C C C C C C C C C C C
charge: -0.045875 -0.214927 -0.102662 -0.053755 0.015078 0.222266 -0.022174 0.300136 0.124786 0.313342 -0.034604 -0.028303 -0.155161 -0.141862 0.052236 -0.112034 -0.106889 -0.004765 0.000302 -0.005134
polarizability: 2.57801244e+02 -9.73301715e+00 2.37937447e+02 8.95199512e+00 1.56795524e+01 1.24795506e+02
1716.lowfreq: -5.3873 -1.9405 -0.0019 -0.0017 -0.0014 4.6894 41.9615 56.8637 66.4167
frequency: 41.9551 56.8603 66.4157 72.6237 89.5208 135.1315 171.8706 181.0860 196.4572 211.1077 247.5334 282.3760 306.6566 307.4368 328.7951 353.3800 373.4201 397.4623 405.7738 447.5207 477.3899 491.1168 519.6618 568.8315 594.6808 615.7181 631.9059 652.3469 654.4585 681.7139 701.1326 706.0134 733.8730 769.8755 785.8408 787.5313 818.3304 858.5079 876.4559 883.8569 903.7160 936.6199 948.5298 951.0049 986.9106 989.8033 1002.0399 1027.4033 1030.3113 1083.5700 1085.9655 1092.0373 1120.9020 1139.7977 1166.7247 1173.4162 1189.3714 1198.7715 1247.5094 1260.1242 1274.9715 1298.6069 1318.0588 1329.2419 1360.0831 1381.0055 1385.2094 1396.3408 1433.8680 1438.7860 1461.6613 1466.1990 1468.9512 1480.9370 1537.3898 1573.1967 1588.4555 1598.6268 1609.3924 1645.0791 2909.4701 3005.4570 3103.6737 3118.8159 3127.8663 3137.4515 3137.5318 3149.8428 3160.9967 3168.7254 3171.2426 3176.4257 3504.7602
redmass: 5.6598 4.2913 8.4774 5.2436 4.4543 6.2355 4.1799 1.4783 2.8081 3.9997 4.7298 4.0127 5.8357 12.0380 5.8137 4.6176 5.2755 4.5323 2.8594 4.8987 5.8493 3.9831 3.9989 4.7263 2.6503 6.3245 4.7243 2.8569 5.1116 4.9207 1.8886 2.9345 3.0152 4.5573 2.4517 3.5063 1.5477 1.2555 4.0101 2.9708 1.5434 1.8079 1.3703 2.8021 1.3805 6.0703 1.3291 2.1717 1.6621 1.6116 2.1526 1.8987 2.2362 2.5479 2.1632 1.0624 1.1296 2.2498 1.6241 1.5775 2.0397 2.9628 1.3597 1.7858 2.8254 7.1751 7.1080 1.2330 2.2848 2.1861 1.0454 1.1957 2.0517 2.3608 8.8626 7.4638 6.5671 6.8467 6.1374 6.0821 1.0811 1.0359 1.1003 1.1003 1.0849 1.0887 1.0897 1.0931 1.0963 1.0925 1.0999 1.0961 1.0757
irintensity: 0.8440 0.1708 1.6860 0.3124 1.6815 1.2139 1.4322 0.2401 1.2063 0.5128 1.9202 0.5602 0.9406 2.2867 1.7316 8.9919 6.4454 4.6995 0.0945 0.9507 3.8370 9.1777 16.5506 30.1415 32.8259 0.3214 0.4598 19.6736 14.7515 5.6417 47.2116 27.0402 29.0051 24.1636 9.2310 52.0783 46.6185 4.0628 10.5183 4.4880 11.1480 2.9017 1.3904 17.0564 2.5912 1.0258 0.6645 5.3304 8.8025 8.8434 22.3909 23.0366 25.1454 15.1248 0.8815 0.4543 11.5962 53.7622 31.2766 12.0065 49.0481 117.1297 8.1598 3.4941 15.4219 4.3366 4.7516 35.1461 13.6536 13.6542 9.1747 26.8414 101.8042 3.8594 60.0166 24.6381 7.4377 0.7833 0.5429 489.8767 19.1277 23.8404 19.4738 15.1572 0.6915 7.4256 5.3902 27.4164 18.6832 0.3488 18.3034 2.5248 29.9361
temp: 298.150 k
press: 1.00000 atm
elementType: 17 8 7 7 6 6 6 6 6 6 6 6 6 6 6 6 6 6 6 6 1 1 1 1 1 1 1 1 1 1 1 1 1
symmnumber: 1
zpe: 657560.2 jmol-1
zpe.correction: 0.250451 hartree
zpe.thermalcorrener: 0.267247 hartree
zpe.thermalcorrenthalpy: 0.268191 hartree
zpe.thermalcorrgfe: 0.205554 hartree
zpe.sumelectzpe: -1260.908388 hartree
zpe.sumelectthermal: -1260.891593 hartree
zpe.sumelectthermalent: -1260.890649 hartree
zpe.sumelectthermalfe: -1260.953285 hartree
dipole: -2.9337 -0.7866 -0.2773
dipole: 3.0499
quadrupole: -144.2951 -104.8751 -120.1914
quadrupole: 1.0266 10.7628 4.4603
quadrupole: -21.1745 18.2454 2.9291 1.0266 10.7628 4.4603
hfenergy: -1261.1588397 hartree
pointgroup: C01 [X(C16H13Cl1N2O1)]
dipole: -0.113212 -1.1938068 -0.0428855 debye
polarizability: 246.8720728|13.1517222|250.1620608|-11.6338905|6.9025979|123.5000633 unknown
InChI: InChI=1S/C16H13ClN2O/c1-10-16(20)19-14-8-7-12(17)9-13(14)15(18-10)11-5-3-2-4-6-11/h2-10,19H,1H3
charge 0 multiplicity 1
33 atoms
Cl 0.033513 -4.596279 1.182619
O  3.107333 2.712588 -1.048122
N  2.414915 0.501314 -1.057133
N  0.215321 1.800762 0.508854
C  1.662628 1.932067 0.824389
C  0.530825 -0.641551 0.118409
C  -0.281856 0.614755 0.214375
C  1.815702 -0.665081 -0.513606
C  2.455029 1.791219 -0.494191
C  -1.760102 0.54319 -0.027481
C  0.007429 -1.860123 0.635591
C  1.925724 3.283709 1.494035
C  2.504841 -1.899737 -0.66571
C  0.724084 -3.055966 0.496413
C  1.967003 -3.09986 -0.169997
C  -2.336133 -0.440409 -0.876799
C  -2.607937 1.518009 0.565808
C  -3.727228 -0.451873 -1.120117
C  -3.996371 1.501104 0.327282
C  -4.563028 0.514466 -0.515906
H  1.995648 1.099563 1.487634
H  3.033364 0.383175 -1.8663
H  -0.964182 -1.855661 1.136774
H  2.991426 3.392587 1.759161
H  1.653996 4.103249 0.809926
H  1.314629 3.367782 2.40881
H  3.482746 -1.911297 -1.160294
H  2.506814 -4.04396 -0.283134
H  -1.698381 -1.182496 -1.368475
H  -2.151713 2.283116 1.201141
H  -4.156227 -1.209826 -1.784645
H  -4.638813 2.254442 0.796372
H  -5.642801 0.502122 -0.701584
