program: Gaussian 09
title: 000038197
version: EM64L-G09RevD.01
frameworkgroup: C1[X(C16H16N6O8)]
method: RPBEPBE
basis: SDD
operation: Freq
keyword: #p
keyword: freq=noraman
keyword: PBEPBE/SDD
title: #p freq=noraman PBEPBE/SDD
converged: YES YES NO NO
title: Mulliken charges:
elementType: O O O O O O O O N N N N N N C C C C C C C C C C C C C C C C H H H H H H H H H H H H H H H H
charge: -0.196103 -0.191495 -0.237753 -0.236644 -0.198108 -0.195286 -0.209931 -0.217518 -0.368881 -0.363106 0.078170 0.084674 0.045559 0.049892 -0.376864 -0.388735 -0.546326 -0.531840 0.217536 0.207872 0.390261 0.387224 -0.374437 -0.378136 -0.318280 -0.318879 0.314266 0.308050 -0.290647 -0.296068 0.236416 0.209864 0.210571 0.236591 0.250631 0.236507 0.245359 0.246429 0.300548 0.303155 0.245873 0.248924 0.293165 0.295967 0.295056 0.296476
chargesum: 0.00000
title: Mulliken charges with hydrogens summed into heavy atoms:
elementType: O O O O O O O O N N N N N N C C C C C C C C C C C C C C C C
charge: -0.196103 -0.191495 -0.237753 -0.236644 -0.198108 -0.195286 -0.209931 -0.217518 -0.068333 -0.059951 0.078170 0.084674 0.045559 0.049892 0.069416 0.058427 -0.059188 -0.040053 0.217536 0.207872 0.390261 0.387224 -0.128564 -0.129212 -0.025115 -0.022912 0.314266 0.308050 0.004409 0.000407
polarizability: 5.64937659e+02 -1.04170415e+01 2.01072752e+02 2.35628764e+00 5.46582833e+01 1.75369653e+02
1716.lowfreq: -12.4450 -5.2612 -2.7193 0.0005 0.0006 0.0008 3.5744 21.1198 26.0424
frequency: -12.1819 20.6549 25.8986 29.5394 40.6559 44.0283 49.8045 51.7559 60.6707 75.6111 76.9046 93.3798 101.6301 130.4674 139.7003 144.9081 147.7322 172.6692 182.4236 206.9665 211.7283 228.0123 238.3995 243.2996 254.6617 259.3785 280.8564 314.8547 356.3964 363.9055 392.5293 400.7685 401.5120 416.8632 460.1236 470.3852 486.6841 534.5771 535.8466 564.6906 568.0564 607.1859 614.8029 629.0698 645.0601 649.9767 651.1735 664.1261 679.0988 680.8969 684.4509 733.2707 734.7493 756.9090 758.3861 788.9327 821.1091 826.4773 827.2917 880.6061 910.5411 911.4433 912.7133 917.6131 919.9991 920.9417 929.3779 931.9779 944.3719 966.0945 982.7796 1012.4802 1019.1541 1021.5320 1030.3911 1044.6608 1094.2641 1096.6133 1132.0213 1137.5784 1138.7134 1142.1665 1169.7978 1172.5150 1207.1953 1212.4918 1218.9240 1223.8311 1237.9607 1259.2887 1265.6829 1277.8196 1318.4100 1323.1315 1326.6314 1335.2524 1337.0136 1345.3102 1349.3658 1372.5930 1373.1374 1374.5708 1453.0280 1455.5118 1466.4420 1468.5652 1474.0216 1484.9218 1510.3372 1512.9709 1549.4662 1550.9811 1587.3147 1588.4380 1646.2340 1648.1531 2974.7782 2979.7482 2995.1819 2997.9536 3015.2889 3018.5787 3026.7212 3050.8889 3082.2374 3085.9698 3240.4833 3240.7268 3260.1347 3261.1095 3369.4957 3371.1876
redmass: 7.4609 9.0372 7.1043 6.9018 9.1633 8.2249 7.2963 7.1058 8.1142 7.6825 8.2718 8.4169 7.2801 7.1552 7.5650 6.6846 8.6472 4.6892 3.0954 5.1102 5.6192 3.3352 3.3338 2.8521 6.9234 6.7520 3.4541 3.3275 5.0662 4.7989 3.6620 7.8923 6.9579 4.0887 7.2132 6.0258 4.8891 6.4065 6.6357 5.9587 5.9833 4.6298 4.6107 1.2984 1.8911 2.8928 3.1357 2.0168 2.6426 8.2764 7.6363 12.6749 12.4813 5.3390 5.4287 1.8484 2.1248 1.3035 1.3008 2.4021 1.3902 1.3884 5.1704 3.7814 5.5013 6.3289 1.5054 1.5019 2.9828 3.7032 2.7449 2.1667 1.3061 1.3503 3.0293 2.0511 4.2503 4.2114 5.1496 4.2105 1.7624 2.4961 3.5040 3.1572 2.0434 1.5830 1.7249 1.7509 1.5429 5.2869 6.1619 1.2786 1.2639 1.3244 1.2237 2.0022 2.0143 8.9864 8.9027 3.8250 3.6986 1.4708 1.1326 1.2010 1.7517 1.0930 2.2027 1.2927 3.0429 2.9514 5.9723 6.0666 5.8732 6.1145 7.5444 7.6482 1.0629 1.0643 1.0660 1.0652 1.0881 1.0882 1.0941 1.1010 1.0971 1.0982 1.0956 1.0955 1.1044 1.1043 1.0755 1.0755
irintensity: 1.1194 0.6350 0.1281 2.8153 17.4515 1.6389 1.6516 3.7881 0.4240 6.3016 7.8707 4.4876 6.9009 0.3826 1.7231 6.5242 2.5482 0.3203 0.9572 7.2230 0.1970 50.3802 5.3378 5.4504 0.0622 1.4155 0.9962 2.3288 0.1106 0.5945 11.1018 0.2380 1.2823 1.8117 0.0148 0.1700 0.7653 0.9980 1.9090 2.9852 2.5985 19.6013 24.9913 148.3010 0.9865 4.2917 13.4681 6.8303 0.3557 26.2320 6.0926 11.1801 18.5528 11.3727 0.8516 47.7835 23.1558 48.5873 68.8082 4.5329 3.1640 3.2349 0.4188 8.4998 8.0381 7.5243 80.3762 1.3766 1.7666 10.9199 2.4210 32.8247 64.6457 68.4125 5.5204 3.4265 90.5415 59.5417 38.5941 300.9536 11.5487 186.4197 13.4397 262.0146 7.7114 169.9890 16.4280 352.7122 337.2922 44.5715 301.4039 0.4498 4.1153 1.5980 1.0132 12.5831 8.3844 122.9477 132.8128 43.6832 20.1790 2.0188 120.2094 75.0660 56.1363 36.1825 457.9277 35.1341 4.9939 81.1537 16.2453 65.9546 6.4085 1.9891 232.2430 223.7385 5.9048 30.0371 23.9483 13.3529 22.5379 20.7272 7.6088 87.8986 23.1339 26.7080 0.2180 0.3232 7.2262 6.8077 0.6766 0.2201
temp: 298.150 k
press: 1.00000 atm
elementType: 8 8 8 8 8 8 8 8 7 7 7 7 7 7 6 6 6 6 6 6 6 6 6 6 6 6 6 6 6 6 1 1 1 1 1 1 1 1 1 1 1 1 1 1 1 1
symmnumber: 1
zpe: 852923.8 jmol-1
zpe.correction: 0.324862 hartree
zpe.thermalcorrener: 0.352468 hartree
zpe.thermalcorrenthalpy: 0.353412 hartree
zpe.thermalcorrgfe: 0.263528 hartree
zpe.sumelectzpe: -1547.126474 hartree
zpe.sumelectthermal: -1547.098867 hartree
zpe.sumelectthermalent: -1547.097923 hartree
zpe.sumelectthermalfe: -1547.187807 hartree
dipole: 10.2692 -0.7644 0.3029
dipole: 10.3021
quadrupole: -206.9513 -181.6241 -168.6944
quadrupole: -4.2590 3.2635 -9.0491
quadrupole: -21.1947 4.1325 17.0622 -4.2590 3.2635 -9.0491
hfenergy: -1547.451335 hartree
pointgroup: C01 [X(C16H16N6O8)]
dipole: -4.0500373 0.1472774 0.0589401 debye
polarizability: 565.1391582|4.6835314|194.6505846|4.5269404|-55.7292316|181.5903206 unknown
InChI: InChI=1S/C16H16N6O8/c23-13(19-17-9-11-5-7-15(29-11)21(25)26)3-1-2-4-14(24)20-18-10-12-6-8-16(30-12)22(27)28/h5-10,19-20H,1-4H2
charge 0 multiplicity 1
46 atoms
O  -3.866217 2.882215 -1.249177
O  -4.168677 -3.195178 0.975862
O  2.078154 1.638124 0.741131
O  1.781592 -1.506285 -0.616501
O  5.515861 2.322571 0.05047
O  5.218616 -2.237292 0.05172
O  4.543435 0.908041 1.584724
O  4.25271 -0.622941 -1.275689
N  -2.625639 1.939197 0.507467
N  -2.920261 -1.879604 -0.514189
N  -1.410201 2.20397 -0.081875
N  -1.70953 -2.268194 0.00582
N  4.493678 1.747477 0.600277
N  4.196104 -1.610322 -0.437928
C  -5.292981 0.387358 0.721384
C  -5.424684 -0.244125 -0.684158
C  -5.08146 1.927511 0.673677
C  -5.382523 -1.7964 -0.65262
C  -3.836338 2.320817 -0.127612
C  -4.135643 -2.375343 0.028174
C  0.973957 2.119668 0.002895
C  0.670934 -2.143083 -0.018252
C  -0.32202 1.815485 0.559441
C  -0.61919 -1.740868 -0.523362
C  1.430615 2.837766 -1.1130
C  1.116916 -3.064551 0.942383
C  3.210189 2.085408 0.056655
C  2.908061 -2.064892 -0.005986
C  2.859715 2.819024 -1.073816
C  2.545589 -3.015842 0.945881
H  -6.204237 0.170978 1.3108
H  -4.456308 -0.091965 1.268687
H  -4.633151 0.153757 -1.351234
H  -6.378674 0.075201 -1.145114
H  -5.937158 2.414077 0.17631
H  -5.020922 2.326734 1.705144
H  -5.456187 -2.192369 -1.685067
H  -6.243546 -2.194065 -0.089186
H  -2.6758 1.488404 1.435475
H  -2.96582 -1.206974 -1.296387
H  -0.32372 1.275055 1.52505
H  -0.614367 -1.005649 -1.349878
H  0.790503 3.319175 -1.848403
H  0.469715 -3.693145 1.549247
H  3.558992 3.266253 -1.774996
H  3.236717 -3.589077 1.558055
