program: Gaussian 09
title: 000038183
version: EM64L-G09RevD.01
frameworkgroup: C1[X(C23H32NO)]
method: RPBEPBE
basis: SDD
operation: Freq
keyword: #p
keyword: freq=noraman
keyword: PBEPBE/SDD
title: #p freq=noraman PBEPBE/SDD
converged: YES YES NO NO
title: Mulliken charges:
elementType: O N C C C C C C C C C C C C C C C C C C C C C C C H H H H H H H H H H H H H H H H H H H H H H H H H H H H H H H H
charge: -0.247788 -0.109989 -0.365791 -0.300148 -0.291132 -0.291603 -0.411815 -0.443731 -0.706151 -0.707227 -0.710484 -0.358404 0.508179 0.062956 -0.453688 -0.386537 0.306873 -0.225120 -0.228484 -0.337592 -0.360052 -0.237705 -0.248850 -0.226135 -0.216499 0.258819 0.266492 0.258911 0.256668 0.250127 0.265381 0.268908 0.257568 0.255342 0.221661 0.236705 0.227843 0.236527 0.249184 0.243252 0.264572 0.244191 0.244233 0.264450 0.239738 0.240713 0.268846 0.236047 0.252159 0.237776 0.237023 0.252430 0.275266 0.242950 0.242228 0.243918 0.246993
chargesum: 1.00000
title: Mulliken charges with hydrogens summed into heavy atoms:
elementType: O N C C C C C C C C C C C C C C C C C C C C C C C
charge: -0.247788 -0.109989 0.159520 0.215431 0.224376 0.234873 0.065188 0.020816 0.050857 0.045646 0.038813 -0.121878 0.508179 0.062956 -0.217642 -0.134378 0.306873 0.012656 0.008539 -0.085162 -0.084786 0.005245 -0.006623 0.017783 0.030493
polarizability: 2.80904664e+02 2.42137310e+00 2.60479008e+02 -1.92942654e+01 -9.90327559e+00 2.18458190e+02
1716.lowfreq: -12.2087 -9.5851 0.0002 0.0004 0.0005 2.2389 7.0053 13.8951 26.6462
frequency: -6.4003 10.5986 26.5988 34.5306 37.6321 50.9151 66.8938 76.1150 89.5918 112.6937 122.1624 129.3999 138.5644 156.4078 187.1193 193.1965 200.8523 221.7082 233.1225 251.1311 255.9743 269.6143 296.4813 326.1508 337.8817 347.3124 367.1281 376.2769 396.4819 402.0119 404.3218 426.5442 454.6192 471.8467 478.6206 535.8533 549.8568 581.7310 611.4714 613.6495 638.6299 670.0342 684.1580 693.9629 709.7861 719.9975 759.4971 770.1501 773.7447 785.1418 786.9457 804.6574 844.5491 849.6984 855.7475 858.5542 872.5996 897.3245 911.6340 928.2862 949.1509 959.4524 982.5006 989.4451 990.6813 994.0125 1004.3393 1010.4115 1014.6992 1023.8404 1026.2979 1027.6836 1030.3578 1038.2879 1047.5760 1064.6030 1074.6154 1082.0017 1085.4238 1090.9436 1108.9527 1122.9723 1150.4425 1166.0772 1177.1195 1177.7425 1181.9217 1187.5162 1190.9458 1195.4173 1204.8920 1221.0771 1244.7492 1276.4928 1285.1442 1289.3884 1293.2294 1311.5251 1316.4935 1330.9975 1332.9403 1339.0679 1351.1070 1354.5570 1365.8707 1376.7624 1380.9533 1381.2646 1389.6365 1410.5930 1415.7345 1422.9402 1436.2360 1442.9727 1449.9675 1458.6093 1468.4089 1472.7914 1473.7534 1476.3979 1478.8584 1480.4633 1480.9806 1485.1372 1486.2399 1489.5141 1492.0125 1499.4163 1544.9044 1588.5986 1593.2155 1607.4089 1610.1765 2983.6143 2996.3972 3001.0766 3007.2382 3007.9455 3009.1813 3029.7471 3037.6769 3042.5372 3051.0407 3057.3826 3079.2285 3092.3914 3094.9564 3095.8787 3097.2881 3099.6797 3101.3640 3106.6132 3109.9087 3119.6381 3121.8344 3122.5433 3125.9961 3138.2420 3140.3139 3147.4072 3151.5091 3158.4420 3167.3095 3170.0057 3177.1290
redmass: 3.4581 4.0650 5.6917 3.8979 4.0277 3.8100 1.9219 3.1880 3.2684 2.4425 2.1421 3.5367 2.9357 4.2627 2.2992 2.8389 2.6915 1.5119 1.5371 2.4443 2.0119 1.8201 2.2280 2.1220 2.4760 6.3379 2.3501 3.4022 2.8717 3.2947 3.0761 3.6577 3.0993 3.8541 3.7273 3.4215 3.1155 3.5980 6.3547 6.2881 4.1955 3.0522 4.6158 1.8615 1.7507 1.5696 1.5676 1.5936 1.4440 1.5775 1.6843 1.4176 1.9863 3.2118 1.2945 1.2491 1.8289 2.1155 2.0380 1.4227 1.4780 4.0347 1.4024 5.3369 4.7266 1.5269 1.3321 1.8623 1.3495 2.3145 2.3387 2.1966 2.5351 2.9603 2.4534 2.2055 1.9114 1.8321 1.7357 1.7361 2.1464 2.3246 1.6753 1.9222 1.0727 1.0718 1.8769 1.5338 1.1240 1.2919 1.6150 1.6591 2.2103 1.2784 1.3499 1.1254 1.2360 1.1776 1.2652 1.2911 1.3052 1.2171 1.2379 1.3159 1.3056 1.2987 1.3037 6.4432 8.6241 1.2165 1.1857 1.1963 2.2656 2.1412 1.0983 1.0744 1.0796 1.0691 1.0641 1.0637 2.1691 1.1985 1.8089 1.0489 1.0587 1.0619 1.0550 1.0748 7.6500 6.2071 6.0161 5.9579 6.1196 1.0819 1.0608 1.0625 1.0375 1.0377 1.0380 1.0595 1.0605 1.0603 1.0621 1.0978 1.1011 1.1037 1.0994 1.0984 1.0986 1.1004 1.1017 1.1043 1.0892 1.1034 1.0884 1.1037 1.1043 1.0859 1.0895 1.0883 1.0952 1.0925 1.0960 1.1012 1.1008
irintensity: 0.3725 1.8711 2.3466 0.0346 0.0350 0.1524 1.5367 1.5132 1.8068 0.3533 0.1003 3.0251 1.1662 0.1219 1.9811 1.4146 1.2111 0.2630 0.0791 3.9030 0.5898 0.1075 0.0166 0.0615 0.0275 7.1925 1.0029 0.7884 0.1517 0.6384 0.2059 1.3350 6.4284 4.2936 2.1811 19.2525 2.3280 16.6338 0.1354 0.4412 5.1448 2.1478 7.0158 54.9110 54.6347 33.2238 25.8779 32.0723 14.8000 23.5124 46.5579 1.1545 4.4425 1.4671 0.3302 0.3772 2.1591 12.3050 2.8854 1.0609 4.7503 44.1459 0.2117 3.8467 2.3175 1.4015 0.3871 27.7870 0.2200 1.3145 11.8621 10.3857 17.2215 9.6908 3.6141 4.0939 1.5548 11.4291 4.1634 7.0572 12.5885 3.5773 10.0997 6.5835 2.1523 3.0525 16.0287 27.8860 3.6408 3.3953 10.9120 17.0693 142.6309 37.4983 15.1377 3.1223 21.2804 17.5313 4.4977 7.6371 9.5151 6.3747 5.8003 8.5884 0.2112 5.1383 2.1332 0.7063 4.3917 22.4085 42.4866 29.1817 27.9099 8.7212 17.1543 2.6559 3.4023 52.2313 7.5038 18.7428 2.9017 38.5506 35.9101 10.2985 4.4881 10.6863 12.6730 0.3908 185.6530 16.5807 3.9316 22.9636 2.9435 11.2032 15.1818 29.0465 4.3288 5.0248 4.6824 12.0728 9.7006 8.6090 6.0706 5.8141 5.6107 0.6587 5.3819 3.5282 8.7949 6.0730 5.0421 21.5188 11.1780 31.1533 5.2711 29.3814 15.2398 0.1782 2.2767 2.7861 21.4154 6.7819 20.9993 16.9973 11.8207
temp: 298.150 k
press: 1.00000 atm
elementType: 8 7 6 6 6 6 6 6 6 6 6 6 6 6 6 6 6 6 6 6 6 6 6 6 6 1 1 1 1 1 1 1 1 1 1 1 1 1 1 1 1 1 1 1 1 1 1 1 1 1 1 1 1 1 1 1 1
symmnumber: 1
zpe: 1306660.6 jmol-1
zpe.correction: 0.497681 hartree
zpe.thermalcorrener: 0.522710 hartree
zpe.thermalcorrenthalpy: 0.523655 hartree
zpe.thermalcorrgfe: 0.440899 hartree
zpe.sumelectzpe: -1023.505046 hartree
zpe.sumelectthermal: -1023.480017 hartree
zpe.sumelectthermalent: -1023.479072 hartree
zpe.sumelectthermalfe: -1023.561828 hartree
dipole: 13.3527 0.1362 2.4971
dipole: 13.5848
quadrupole: -43.7779 -126.5916 -133.8625
quadrupole: -1.4955 -2.6125 -0.8650
quadrupole: 57.6328 -25.1809 -32.4518 -1.4955 -2.6125 -0.8650
hfenergy: -1024.002727 hartree
pointgroup: C01 [X(C23H32N1O1)]
dipole: -5.2518981 -0.3518435 -0.9270307 debye
polarizability: 280.8502012|-2.0860025|261.0649934|-20.2780097|6.2546375|217.9266678 unknown
InChI: InChI=1S/C23H32NO/c1-4-24(5-2,6-3)19-13-18-22(20-14-9-7-10-15-20)23(25)21-16-11-8-12-17-21/h7-12,14-17,22H,4-6,13,18-19H2,1-3H3
charge 1 multiplicity 1
57 atoms
O  0.143441 1.139831 1.192295
N  -4.26454 -0.225489 -0.150332
C  -2.952386 -1.033799 0.055038
C  -5.450043 -1.040875 0.430879
C  -4.523145 0.035222 -1.656612
C  -4.119505 1.140093 0.578263
C  -1.695421 -0.465235 -0.623111
C  -0.44806 -1.224244 -0.096479
C  -5.419484 -1.262123 1.948444
C  -4.609974 -1.216678 -2.538406
C  -5.37621 2.017342 0.597885
C  0.893935 -0.519758 -0.435556
C  2.069786 -1.429333 -0.045269
C  0.985592 0.854903 0.280642
C  2.737618 -2.198978 -1.030697
C  2.463872 -1.556822 1.31121
C  2.051474 1.826252 -0.106594
C  3.781156 -3.08022 -0.669579
C  3.509952 -2.433989 1.672689
C  3.004866 1.558814 -1.129063
C  2.099598 3.075687 0.574981
C  4.17114 -3.199141 0.684308
C  3.978038 2.522311 -1.463302
C  3.072506 4.035725 0.240648
C  4.014114 3.761938 -0.781799
H  -3.160161 -2.061059 -0.291399
H  -2.792113 -1.065476 1.145407
H  -6.367859 -0.507343 0.131782
H  -5.435345 -2.009988 -0.093569
H  -5.465072 0.60512 -1.712595
H  -3.705541 0.693216 -1.993331
H  -3.787554 0.904776 1.60233
H  -3.291684 1.66554 0.076397
H  -1.569275 0.600014 -0.369465
H  -1.751731 -0.560232 -1.724241
H  -0.418382 -2.251297 -0.506709
H  -0.510187 -1.306034 1.004835
H  0.943271 -0.345251 -1.529859
H  -4.536587 -1.829721 2.284916
H  -5.481961 -0.324086 2.52389
H  -6.306403 -1.863652 2.215409
H  -3.689766 -1.823532 -2.517397
H  -5.470255 -1.860809 -2.293624
H  -4.750899 -0.881038 -3.58106
H  -5.7119 2.322378 -0.407009
H  -6.221936 1.554781 1.132961
H  -5.122247 2.944614 1.141366
H  2.441066 -2.11223 -2.084326
H  1.962327 -0.962687 2.085094
H  4.28995 -3.669279 -1.440318
H  3.812399 -2.51807 2.722108
H  3.006439 0.596999 -1.64975
H  1.365518 3.265111 1.364825
H  4.983773 -3.877394 0.96511
H  4.712012 2.308015 -2.246892
H  3.104828 4.992575 0.771972
H  4.773555 4.507303 -1.041641
