program: Gaussian 16
title: Title Card Required
version: ES64L-G16RevC.01
frameworkgroup: C1[X(C12H19Cl2NO2Pd)]
method: RMN15
basis: def2SVP
operation: Freq
keyword: #N
keyword: Geom=AllCheck
keyword: Guess=TCheck
keyword: SCRF=Check
keyword: GenChk
keyword: RMN15/def2SVPFreq
converged: YES YES NO NO
title: Mulliken charges:
elementType: C C C C C C H H H H H H H H C H C H Pd Cl Cl C N C H H H O O C H H H C H H H
charge: 0.107568 0.064279 0.069003 -0.082421 0.118954 0.056915 0.034166 0.024273 0.022632 0.024735 0.029313 0.023261 0.050755 0.027620 -0.022303 0.035106 -0.051075 -0.010249 -0.102921 -0.342226 -0.364437 -0.287674 0.204937 0.086836 0.079542 0.074009 0.074716 -0.263004 -0.242465 0.173306 0.042046 -0.016374 0.044866 0.141884 0.065371 0.061506 0.047549
chargesum: -0.00000
title: Mulliken charges with hydrogens summed into heavy atoms:
elementType: C C C C C C C C Pd Cl Cl C N C O O C C
charge: 0.171047 0.088552 0.069003 -0.059789 0.166950 0.135289 0.012804 -0.061324 -0.102921 -0.342226 -0.364437 -0.287674 0.204937 0.315102 -0.263004 -0.242465 0.243844 0.316311
chargesum: 0.00000
1716.lowfreq: -451.8285 -3.6011 -0.9645 -0.0021 -0.0020 -0.0017 2.7192 3.9681 16.8959
frequency: -451.8284 3.5383 16.8751 23.3994 31.6844 34.0925 49.6301 91.1188 93.0078 119.7402 121.3549 129.1152 161.0174 171.5799 178.3110 202.8278 203.6451 210.4159 227.1644 247.1422 250.9840 257.3321 269.7515 284.3163 295.8795 326.8335 350.5175 360.0937 393.2047 421.7535 431.8304 442.8396 469.8236 491.9448 531.5606 631.6726 679.5869 707.1651 780.3287 809.9556 840.5214 884.3371 917.3099 968.8788 979.7468 1000.3846 1022.6445 1025.1216 1026.1114 1027.0028 1034.7237 1056.8071 1077.3526 1104.9448 1116.9201 1149.5393 1157.6093 1166.0685 1174.4348 1182.7723 1192.5793 1197.7740 1235.5993 1277.9871 1285.5158 1301.6587 1311.0078 1345.3489 1360.3569 1371.1159 1401.0991 1415.9386 1420.7820 1421.6445 1425.0671 1438.6870 1442.2581 1455.6782 1456.7176 1461.1693 1465.5315 1481.5030 1497.5479 1603.0161 1613.8649 2461.7136 3012.1463 3074.6153 3079.5960 3099.0544 3110.2994 3119.9463 3128.3219 3146.7613 3153.8850 3174.0651 3178.9727 3185.8771 3193.4873 3207.2417 3208.3185 3213.6705 3232.6341 3256.3083 3289.8228
redmass: 10.0275 1.0141 8.8929 4.0619 4.5360 4.4580 4.1317 4.6061 6.9112 6.4147 4.2281 5.3201 11.3488 3.1180 4.0427 5.8305 2.2720 4.4007 1.6167 3.2241 3.2602 2.1582 2.1842 4.2203 7.0253 3.3735 2.7734 16.3869 2.6462 3.5839 4.0014 4.4381 3.1232 3.4479 3.0411 2.3982 3.6686 2.5539 2.1562 1.5139 2.0726 1.4967 2.1054 1.6253 3.6452 1.3484 2.0672 1.4733 1.4737 1.8541 1.6670 1.3939 2.7165 2.3545 1.8703 1.4867 1.3348 1.3981 1.7182 1.2918 1.2814 1.3289 1.5832 1.4350 1.5477 1.8024 1.2859 1.5069 1.4873 1.3129 1.5519 1.1973 1.0363 1.0365 1.1707 1.0357 1.2027 1.0383 1.1267 1.2693 1.1049 1.6201 2.1234 4.9429 4.1395 12.6127 1.0454 1.0663 1.0344 1.0356 1.0628 1.0856 1.0944 1.1013 1.0893 1.1042 1.1082 1.0789 1.0712 1.1050 1.1052 1.1040 1.1053 1.0900 1.1131
irintensity: 1903.8575 0.0400 1.5219 3.3966 7.2842 5.6833 4.6030 3.4668 0.3184 4.9144 2.9247 4.3195 7.5892 12.5724 2.1303 0.1782 0.8975 1.2514 1.4020 2.4555 1.8794 10.5753 6.3785 0.8766 2.7521 11.2571 7.3151 37.3524 45.0732 10.5819 2.8015 12.8218 54.4787 22.7268 8.4246 14.1448 13.1994 13.8146 4.0947 23.3883 1.7651 12.5280 37.7156 51.9035 0.6861 81.0362 43.1703 4.6209 4.8272 18.2965 2.8514 5.1871 29.1732 33.3985 30.6278 55.7687 1.4402 11.8978 6.5340 4.9212 18.3521 43.7364 209.3599 144.3307 19.7972 96.1402 5.0611 11.3334 75.1242 0.1625 140.4876 8.5296 11.6177 12.0224 9.3324 3.7779 43.0164 13.2276 14.9452 14.0839 8.2489 56.5940 77.5889 785.7984 273.5633 3.9555 62.6903 5.0682 37.7109 1.5534 11.1271 8.4220 10.4573 3.3775 4.9712 5.2718 10.3204 3.1668 2.0559 0.1714 0.3920 12.9462 5.9872 4.8770 2.4806
temp: 298.150 k
press: 1.00000 atm
elementType: 6 6 6 6 6 6 1 1 1 1 1 1 1 1 6 1 6 1 46 17 17 6 7 6 1 1 1 8 8 6 1 1 1 6 1 1 1
symmnumber: 1
zpe: 776510.7 jmol-1
zpe.correction: 0.295757 hartree
zpe.thermalcorrener: 0.318588 hartree
zpe.thermalcorrenthalpy: 0.319532 hartree
zpe.thermalcorrgfe: 0.237743 hartree
zpe.sumelectzpe: -1719.691820 hartree
zpe.sumelectthermal: -1719.668990 hartree
zpe.sumelectthermalent: -1719.668046 hartree
zpe.sumelectthermalfe: -1719.749835 hartree
dipole: 6.9382 -0.3771 -4.1346
dipole: 8.0855
quadrupole: -67.7634 -122.6530 -147.6822
quadrupole: 3.3804 9.4744 -0.5695
quadrupole: 44.9361 -9.9535 -34.9826 3.3804 9.4744 -0.5695
hfenergy: -1719.9875776 hartree
pointgroup: C01 [X(C12H19Cl2N1O2Pd1)]
dipole: 2.7298857 -0.1532133 -1.6259235 debye
polarizability: 313.9019307|-10.4352891|195.3971106|-2.5854559|-0.6632108|171.1335351 unknown
InChI: InChI=1S/C10H16O2.C2H3N.2ClH.Pd/c1-11-9-5-3-7-10(12-2)8-4-6-9;1-2-3;;;/h3,5,8,10H,4,6-7H2,1-2H3;1H3;2*1H;/q;;;;+2/p-2
charge 0 multiplicity 1
37 atoms
C  2.52757019 1.98794749 0.79402906
C  0.93472857 1.40062789 0.03572262
C  3.61785286 -0.91383167 0.27067189
C  0.42126136 0.31838572 0.91150645
C  2.63582292 -1.05932812 1.38939403
C  1.1698939 -1.01040374 0.88162371
H  2.44755886 1.50427049 1.76703233
H  1.21900237 1.03445384 -0.96162867
H  0.26045886 0.67737253 1.94006237
H  2.82066897 -0.31694118 2.17977611
H  2.39061334 3.07059053 0.83941182
H  2.83440364 -2.0492386 1.82181445
H  0.58187044 -1.69715851 1.50889726
H  1.13082592 -1.41606747 -0.14479634
C  3.46567742 1.54054677 -0.1509572
H  3.77554981 2.28655505 -0.89381734
C  3.96290173 0.24867533 -0.40735476
H  4.63458219 0.15993854 -1.26111275
Pd -1.43521732 -0.09411544 0.18110075
Cl -2.14175871 -0.13047665 2.38306142
Cl -0.60936501 -0.20944415 -2.03493712
C  -4.42996761 -0.85986898 -0.79203468
N  -3.35633048 -0.57696792 -0.47898279
C  -5.78672439 -1.21801826 -1.17653759
H  -6.37125065 -1.47618251 -0.28352227
H  -6.26830198 -0.37298566 -1.68622402
H  -5.76997343 -2.08056198 -1.85583881
O  0.19669901 2.52978541 0.00820783
O  4.10240113 -2.08578332 -0.08650178
C  0.17769959 3.18234875 -1.23994745
H  -0.45288221 4.07383527 -1.14399011
H  1.20040511 3.49578743 -1.53132541
H  -0.22967896 2.50109801 -2.00510972
C  4.97862164 -2.23616567 -1.18779984
H  5.21063965 -3.30393247 -1.25569076
H  4.49205929 -1.90439699 -2.11735689
H  5.906719 -1.66575878 -1.03122979
