program: Gaussian 09
title: 000038110
version: EM64L-G09RevD.01
frameworkgroup: C1[X(C12H14N2O4)]
method: RPBEPBE
basis: SDD
operation: Freq
keyword: #p
keyword: freq=noraman
keyword: PBEPBE/SDD
title: #p freq=noraman PBEPBE/SDD
converged: YES YES NO NO
title: Mulliken charges:
elementType: O O O O N N C C C C C C C C C C C C H H H H H H H H H H H H H H
charge: -0.279013 -0.226468 -0.201895 -0.203509 0.031898 0.027106 -0.402827 -0.391028 -0.399203 -0.386447 -0.381592 0.199384 0.235313 -0.323733 -0.308435 -0.348285 -0.345006 0.388216 0.222963 0.196614 0.207719 0.221303 0.223562 0.209160 0.196067 0.239383 0.262054 0.197085 0.282315 0.277513 0.290902 0.288882
chargesum: 0.00000
title: Mulliken charges with hydrogens summed into heavy atoms:
elementType: O O O O N N C C C C C C C C C C C C
charge: -0.279013 -0.226468 -0.201895 -0.203509 0.031898 0.027106 0.016751 0.037995 0.033519 0.049003 0.077547 0.199384 0.235313 -0.041418 -0.030922 -0.057384 -0.056123 0.388216
polarizability: 2.84835996e+02 3.50089132e-01 1.57001990e+02 -1.24280496e+00 -6.50929419e+00 8.98606887e+01
1716.lowfreq: -19.9788 -4.6202 -1.4122 -0.0002 0.0005 0.0006 25.7085 32.4090 51.4751
frequency: 23.9677 32.3451 51.4549 63.7651 83.9627 91.3026 129.9815 188.3124 205.4191 228.7595 250.1801 275.7101 320.6150 328.7371 369.8371 408.9995 414.3351 438.7004 459.9553 462.7057 488.9440 515.7020 571.4202 623.2056 648.8386 674.9270 680.9746 731.0306 758.6410 777.5733 797.2244 813.5942 833.0191 854.3326 862.2948 867.4130 886.5020 911.7543 966.1554 994.2943 1001.2002 1009.5324 1010.9276 1035.1058 1038.3862 1060.4292 1089.9768 1102.0043 1109.0579 1143.4317 1149.3733 1175.5678 1210.3774 1222.0756 1228.9355 1255.3945 1259.0698 1265.4274 1292.9621 1325.1401 1338.0932 1343.8307 1344.4547 1357.8748 1366.5799 1405.0879 1413.3412 1452.4727 1461.8029 1465.9214 1472.1428 1473.5692 1487.3416 1591.0687 1607.2139 1632.7539 2918.6950 2926.7124 2976.0396 2997.8925 3000.1467 3044.7541 3059.0250 3066.6679 3072.0446 3086.5898 3164.5142 3175.2579 3187.7960 3193.2185
redmass: 4.3967 4.8284 5.0995 7.1507 5.6634 8.5768 4.8918 6.0330 4.8960 1.8816 5.8507 6.1483 4.1875 2.7168 7.0427 2.8508 2.4056 3.2877 4.0198 2.6788 7.9165 5.9737 2.6734 7.1321 6.3595 7.1389 4.0104 4.9582 5.2202 8.5162 1.4864 7.3139 3.9434 2.3559 1.2642 1.8068 1.6442 2.2900 1.2839 3.9111 1.3436 2.6211 1.3646 3.7512 2.0323 1.7770 3.3165 2.3742 1.3069 1.2670 2.0280 1.2529 5.4919 2.3339 3.6586 1.2420 1.2676 1.2335 1.2600 1.2618 1.3753 1.4403 1.4589 1.3442 7.7539 9.5192 4.2191 1.0860 1.0843 1.0905 1.1553 2.0920 1.0928 8.6199 6.2831 11.6185 1.0692 1.0685 1.0634 1.0616 1.0611 1.0966 1.1022 1.1014 1.0952 1.0937 1.0900 1.0889 1.0958 1.0973
irintensity: 0.1662 0.2408 0.0996 0.0589 0.4902 5.7963 2.4082 0.8963 5.2833 1.3725 0.7056 0.9714 4.2843 0.3407 2.8863 0.5518 4.2335 0.2198 0.6009 2.0736 5.7169 2.6463 3.7105 0.7912 1.6288 5.0558 56.5057 5.8626 3.2690 39.5170 2.2861 6.0312 19.7870 2.2671 1.3980 6.9969 53.5942 8.4893 1.9212 191.3731 0.8769 13.3439 0.0541 104.4650 7.1628 5.8184 16.8946 1.2750 12.3439 2.1568 0.8557 3.7995 572.9151 24.1001 20.3071 10.2649 9.2401 6.3159 0.2911 1.3349 0.1410 2.3825 0.6654 1.3901 84.8981 3.5921 65.5539 9.1216 14.8805 19.1559 2.2205 1.2342 14.7384 23.8736 12.0788 145.3133 36.7878 72.9583 41.0915 27.4940 29.6144 58.7854 28.4275 41.2633 40.6086 11.6496 1.3437 1.0062 0.2805 0.8000
temp: 298.150 k
press: 1.00000 atm
elementType: 8 8 8 8 7 7 6 6 6 6 6 6 6 6 6 6 6 6 1 1 1 1 1 1 1 1 1 1 1 1 1 1
symmnumber: 1
zpe: 652886.9 jmol-1
zpe.correction: 0.248671 hartree
zpe.thermalcorrener: 0.264756 hartree
zpe.thermalcorrenthalpy: 0.265700 hartree
zpe.thermalcorrgfe: 0.203044 hartree
zpe.sumelectzpe: -874.619116 hartree
zpe.sumelectthermal: -874.603032 hartree
zpe.sumelectthermalent: -874.602087 hartree
zpe.sumelectthermalfe: -874.664744 hartree
dipole: 6.2849 -1.4670 0.9787
dipole: 6.5276
quadrupole: -123.2237 -104.7921 -104.6594
quadrupole: -11.1222 4.8285 2.6651
quadrupole: -12.3320 6.0996 6.2323 -11.1222 4.8285 2.6651
hfenergy: -874.8677874 hartree
pointgroup: C01 [X(C12H14N2O4)]
dipole: -2.4396147 0.766615 0.2366126 debye
polarizability: 283.8346356|-5.0872241|147.1128315|-13.0630533|-24.4545596|100.751207 unknown
InChI: InChI=1S/C12H14N2O4/c15-12(18-13-8-2-1-3-9-13)10-4-6-11(7-5-10)14(16)17/h4-7H,1-3,8-9H2
charge 0 multiplicity 1
32 atoms
O  -1.368647 0.301413 -0.074303
O  -0.973667 -1.905646 0.643967
O  5.904446 -0.584074 -0.185265
O  5.407233 1.529259 -0.885541
N  -2.868297 -0.014787 -0.071499
N  5.066881 0.357723 -0.46324
C  -5.579572 0.879687 0.494414
C  -4.973973 0.913256 -0.927849
C  -4.863919 -0.187139 1.354333
C  -3.441189 1.110249 -0.86884
C  -3.333589 0.034246 1.353463
C  -0.556247 -0.798929 0.238909
C  0.890914 -0.450827 0.04552
C  1.849353 -1.454524 0.344187
C  1.314154 0.82197 -0.42061
C  3.222177 -1.19808 0.178803
C  2.68483 1.091931 -0.589604
C  3.61751 0.07569 -0.286106
H  -6.663898 0.669347 0.444254
H  -5.46417 1.87575 0.968966
H  -5.411975 1.732908 -1.52739
H  -5.192655 -0.036819 -1.451089
H  -5.076189 -1.196889 0.955367
H  -5.221669 -0.161117 2.40042
H  -3.19902 2.096703 -0.409692
H  -2.997859 1.070975 -1.87756
H  -2.822825 -0.772494 1.90237
H  -3.081629 1.015221 1.817816
H  1.494508 -2.426181 0.701228
H  0.567505 1.5868 -0.647126
H  3.982213 -1.951851 0.399027
H  3.043167 2.060629 -0.946728
